{"text_format":"3","workbook":"xlsx","n_sheets":7,"sheets":["Försättsblad","Räkna på nyttorna","Nyttor","Kostnader","Nyttokalkyl","Data antal samtal","-Admin-"],"not_rendered":{"charts":15,"macros":1,"defined_names":8,"comments":2,"pivot_tables":9},"read":"whole","date_system":"1900"}

{"sheet":"Försättsblad","index":0,"n_rows":33,"n_cols":6,"rows_kept":33,"merged":[[19,4,20,5]]}
[null,"Försättsblad"]
[null,{"$f":"IF(B6=0,\"\",B6)","v":"Första linjens digitala vård - nya kanaler - bild och video"}]
[]
[]
[null,"Tjänst / projekt / förändringsinitiativ"]
[null,"Första linjens digitala vård - nya kanaler - bild och video"]
[]
[]
[null,"Revisionshistorik"]
[null,"Version","Datum","Författare","Kommentar"]
[null,"0.1","2019-07-01","Amanda Sundberg","Preliminär kalkyl för bild"]
[null,"0.2","2020-09-01","Amanda Sundberg","Uppdaterade bildkalkyl efter effektmätningar i pilot"]
[null,"0.3","2020-12-01","Amanda Sundberg","Uppdaterade bild och video till nationell kalkyl"]
[null,"0.4","2021-02-17","Amanda Sundberg","Lägger ihop bild och video i samma kalkyl, justerar"]
[null,"0.5","2021-03-10","Amanda Sundberg","Justerar andel lämpliga samtal, separerar bild & video"]
[]
[]
[]
[null,"Startår",null,null,"Diskonteringsränta"]
[null,"Från när vill ni börja räkna nyttor och kostnader? ",null,null,"Diskontering innebär att nytta och kostnader som inträffar i framtiden värderas lägre med en viss ränta. Kalkylmallen är förinställd på att räkna med TLVs rekommendation på 3%, men värdet kan ändras nedan. "]
[]
[null,"Parameter","Värde",null,"Parameter","Värde"]
[null,"Startår",2019,null,"Diskonteringsränta",{"v":0.03,"d":"3%"}]
[]
[]
[null,"Intressenter"]
[null,"Ange de intressenter som bär nyttor eller kostnader alternativt är involverade i genomförandet. \nDe intressenter som anges här kommer att visas och bli valbara i den här mallens flikar om kostnader och nyttor. "]
[]
[null,"Intressent"]
[null,"Regioner"]
[null,"Invånare"]
[null,"Inera"]
[null,"Staten"]

{"sheet":"Räkna på nyttorna","index":1,"n_rows":349,"n_cols":18,"rows_kept":349,"merged":[[9,2,17,2],[26,2,34,2],[43,2,51,2],[60,2,68,2],[77,2,85,2],[94,2,102,2],[111,2,119,2],[128,2,136,2],[145,2,153,2],[162,2,170,2],[179,2,187,2],[196,2,204,2],[213,2,221,2],[230,2,238,2],[247,2,255,2],[264,2,272,2],[281,2,289,2],[298,2,306,2],[315,2,323,2],[332,2,340,2],[349,2,357,2]]}
[null,null,"Räkna på nyttorna"]
[null,null,{"$f":"IF(Försättsblad!B6=0,\"\",Försättsblad!B6)","v":"Första linjens digitala vård - nya kanaler - bild och video"}]
[]
[{"$nulls":4},"Skriv en beskrivande rubrik på nyttan. ","Ange ert troligaste värde. ","Ange ett min- och max-värde för att få en osäkerhetsbedömning",null,"Var kommer informationen ifrån? ",null,null,"Fyll i nyttan år för år. Dessa summeras sedan automatiskt. Tänk på att alla nyttor kanske inte infaller från första året. ",{"$nulls":5},"Summeras automatiskt"]
[1,null,"Välj nyttokategori: ",null,"Bild - frigjorda vårdbesök","Trolig","Min","Max","Källa ",null,null,{"$f":"Startår","v":2019},{"$f":"L5+1","v":2020},{"$f":"M5+1","v":2021},2022,2023,2024,"Summa"]
[null,null,"2. Omfördelningsnytta",null,"Besvarade invånarsamtal 1177 i snitt för 19 regioner som inför bild",{"$f":"'Data antal samtal'!C22","v":{"v":2728381,"d":"2,728,381 "}},{"$f":"F6","v":{"v":2728381,"d":"2,728,381 "}},{"$f":"F6","v":{"v":2728381,"d":"2,728,381 "}},"Baseras på antal besvarade samtal för de 19 regionerna 2019",null,"Trolig",null,null,{"$f":"N9*$F$19","v":{"v":8797227.993539996,"d":"8,797,228 "}},{"$f":"O9*$F$19","v":{"v":26391683.980619993,"d":"26,391,684 "}},{"v":26391683.980619993,"d":"26,391,684 "},{"v":26391683.980619993,"d":"26,391,684 "},{"$f":"SUM(L6:Q6)","v":{"v":87972279.93539998,"d":"87,972,280 "}}]
[null,null,"Välj intressent: ",null,"Andel av samtalen som lämpar sig för bildsamtal",{"v":0.07,"d":"7%"},{"v":0.05,"d":"5%"},{"v":0.1,"d":"10%"},"Bedömning utifrån piloterna och samtal med medicinskt sakkunnig. ",null,"Min",null,null,{"$f":"N9*$G$19","v":{"v":6283734.281099997,"d":"6,283,734 "}},{"$f":"O9*$G$19","v":{"v":18851202.843299992,"d":"18,851,203 "}},{"v":18851202.843299992,"d":"18,851,203 "},{"v":18851202.843299992,"d":"18,851,203 "},{"$f":"SUM(L7:Q7)","v":{"v":62837342.810999975,"d":"62,837,343 "}}]
[null,null,"Regioner",null,"Antal samtal lämpade för bildsamtal per år",{"$f":"F7*F6","v":{"v":190986.67,"d":"190,987 "}},{"$f":"G7*G6","v":{"v":136419.05000000002,"d":"136,419 "}},{"v":272838.10000000003,"d":"272,838 "},null,null,"Max",null,null,{"$f":"N9*$H$19","v":{"v":12567468.562199995,"d":"12,567,469 "}},{"v":37702405.686599985,"d":"37,702,406 "},{"v":37702405.686599985,"d":"37,702,406 "},{"v":37702405.686599985,"d":"37,702,406 "},{"$f":"SUM(L8:Q8)","v":{"v":125674685.62199995,"d":"125,674,686 "}}]
[null,null,"Anteckningar",null,"Andel röstsamtal - lämpade för bild - som får egenvårdsråd",{"v":0.33,"d":"33%"},{"v":0.33,"d":"33%"},{"v":0.33,"d":"33%"},"Resultat från bild- och videopiloter",{"$nulls":4},0.3,0.9,0.9,0.9]
[{"$nulls":4},"Antal röstsamtal - lämpade för bild - som får egenvårdsråd",{"$f":"F9*F8","v":{"v":63025.60110000001,"d":"63,026 "}},{"$f":"G9*G8","v":{"v":45018.28650000001,"d":"45,018 "}},{"v":90036.57300000002,"d":"90,037 "}]
[{"$nulls":4},"Andel bildsamtal som får egenvårdsråd",{"v":0.42,"d":"42%"},{"v":0.42,"d":"42%"},{"v":0.42,"d":"42%"},"Resultat från bild- och videopiloter"]
[{"$nulls":4},"Antal bildsamtal som får egenvårdsråd",{"$f":"F11*F8","v":{"v":80214.4014,"d":"80,214 "}},{"$f":"G11*G8","v":{"v":57296.001000000004,"d":"57,296 "}},{"v":114592.00200000001,"d":"114,592 "}]
[{"$nulls":4},"Antal besök i primärvården som kan undvikas genom att använda bild",{"$f":"F12-F10","v":{"v":17188.800299999995,"d":"17,189 "}},{"$f":"G12-G10","v":{"v":12277.714499999995,"d":"12,278 "}},{"v":24555.42899999999,"d":"24,555 "}]
[{"$nulls":4},"Regionens kostnad för ett besök i primärvården",{"v":1706,"d":"1,706 "},{"v":1706,"d":"1,706 "},{"v":1706,"d":"1,706 "},"Vården i siffror"]
[]
[]
[]
[]
[{"$nulls":5},{"$f":"F14*F13","v":{"v":29324093.311799992,"d":"29,324,093 "}},{"$f":"G14*G13","v":{"v":20945780.93699999,"d":"20,945,781 "}},{"$f":"H14*H13","v":{"v":41891561.87399998,"d":"41,891,562 "}}]
[]
[]
[2,null,"Välj nyttokategori: ",null,"Bild - sparar tid för invånare","Trolig","Min","Max","Källa ",null,null,{"$f":"Startår","v":2019},{"$f":"L22+1","v":2020},{"$f":"M22+1","v":2021},{"$f":"N22+1","v":2022},{"$f":"O22+1","v":2023},{"$f":"P22+1","v":2024},"Summa"]
[null,null,"2. Omfördelningsnytta",null,"Antal besök i primärvården som kan undvikas genom att använda bild",{"$f":"F13","v":{"v":17188.800299999995,"d":"17,189 "}},{"$f":"G13","v":{"v":12277.714499999995,"d":"12,278 "}},{"v":24555.42899999999,"d":"24,555 "},"Se ovan",null,"Trolig",null,null,{"$f":"N26*$F$36","v":{"v":1320615.5270489997,"d":"1,320,616 "}},{"$f":"O26*$F$36","v":{"v":3961846.5811469997,"d":"3,961,847 "}},{"v":3961846.5811469997,"d":"3,961,847 "},{"v":3961846.5811469997,"d":"3,961,847 "},{"$f":"SUM(L23:Q23)","v":{"v":13206155.27049,"d":"13,206,155 "}}]
[null,null,"Välj intressent: ",null,"Snittrestid tur och retur vårdmottagning (timmar)",{"v":0.3,"d":"0.3 "},{"v":0.3,"d":"0.3 "},{"v":0.3,"d":"0.3 "},"Socialstyrelsen, Tillgänglighet i hälso- och sjukvården",null,"Min",null,null,{"$f":"N26*$G$36","v":{"v":725612.9269499996,"d":"725,613 "}},{"$f":"O26*$G$36","v":{"v":2176838.780849999,"d":"2,176,839 "}},{"v":2176838.780849999,"d":"2,176,839 "},{"v":2176838.780849999,"d":"2,176,839 "},{"$f":"SUM(L24:Q24)","v":{"v":7256129.269499997,"d":"7,256,129 "}}]
[null,null,"Invånare",null,"Snittid på vårdmottagning (timmar)",{"v":1,"d":"1 "},{"v":1,"d":"1 "},{"v":1,"d":"1 "},"Uppskattning baserad på personlig erfarenhet (hitta rätt, vänta, besök, gå på toalett, klä på sig)",null,"Max",null,null,{"$f":"N26*$H$36","v":{"v":1451225.8538999993,"d":"1,451,226 "}},{"$f":"O26*$H$36","v":{"v":4353677.561699998,"d":"4,353,678 "}},{"v":4353677.561699998,"d":"4,353,678 "},{"v":4353677.561699998,"d":"4,353,678 "},{"$f":"SUM(L25:Q25)","v":{"v":14512258.538999993,"d":"14,512,259 "}}]
[null,null,"Anteckningar",null,"Värdering av tid för vårdbesök för invånaren",{"v":197,"d":"197 "},{"v":197,"d":"197 "},{"v":197,"d":"197 "},"Baseras på medianlön i Sverige och att besök sker på arbetstid",{"$nulls":4},0.3,0.9,0.9,0.9]
[{"$nulls":4},"Sparad tid",{"$f":"(F24+F25)*F23*F26","v":{"v":4402051.756829999,"d":"4,402,052 "}},{"$f":"(G24+G25)*G23*G26","v":{"v":3144322.6834499985,"d":"3,144,323 "}},{"v":6288645.366899997,"d":"6,288,645 "}]
{"$rows_empty":8}
[{"$nulls":5},{"$f":"F27","v":{"v":4402051.756829999,"d":"4,402,052 "}},{"$f":"G26*G23","v":{"v":2418709.7564999987,"d":"2,418,710 "}},{"$f":"H26*H23","v":{"v":4837419.5129999975,"d":"4,837,420 "}}]
[]
[]
[3,null,"Välj nyttokategori: ",null,"Bild - sparar pengar för invånare","Trolig","Min","Max","Källa ",null,null,{"$f":"Startår","v":2019},{"$f":"L39+1","v":2020},{"$f":"M39+1","v":2021},{"$f":"N39+1","v":2022},{"$f":"O39+1","v":2023},{"$f":"P39+1","v":2024},"Summa"]
[null,null,"1. Finansiell",null,{"$f":"E13","v":"Antal besök i primärvården som kan undvikas genom att använda bild"},{"$f":"F13","v":{"v":17188.800299999995,"d":"17,189 "}},{"v":12277.714499999995,"d":"12,278 "},{"v":24555.42899999999,"d":"24,555 "},0,null,"Trolig",null,null,{"$f":"N43*$F$53","v":{"v":1005544.8175499996,"d":"1,005,545 "}},{"$f":"O43*$F$53","v":{"v":3016634.452649999,"d":"3,016,634 "}},{"v":3016634.452649999,"d":"3,016,634 "},{"v":3016634.452649999,"d":"3,016,634 "},{"$f":"SUM(L40:Q40)","v":{"v":10055448.175499996,"d":"10,055,448 "}}]
[null,null,"Välj intressent: ",null,"Patientavgift för ett besök i primärvården",{"v":195,"d":"195 "},{"v":195,"d":"195 "},{"v":195,"d":"195 "},"SKR, Patientavgifter",null,"Min",null,null,{"$f":"N43*$G$53","v":{"v":718246.2982499996,"d":"718,246 "}},{"v":2154738.894749999,"d":"2,154,739 "},{"v":2154738.894749999,"d":"2,154,739 "},{"v":2154738.894749999,"d":"2,154,739 "},{"$f":"SUM(L41:Q41)","v":{"v":7182462.982499996,"d":"7,182,463 "}}]
[{"$nulls":4},"Sparade pengar",{"$f":"F41*F40","v":{"v":3351816.058499999,"d":"3,351,816 "}},{"$f":"G41*G40","v":{"v":2394154.3274999987,"d":"2,394,154 "}},{"v":4788308.6549999975,"d":"4,788,309 "},null,null,"Max",null,null,{"$f":"N43*$H$53","v":{"v":1436492.5964999993,"d":"1,436,493 "}},{"v":4309477.789499998,"d":"4,309,478 "},{"v":4309477.789499998,"d":"4,309,478 "},{"v":4309477.789499998,"d":"4,309,478 "},{"$f":"SUM(L42:Q42)","v":{"v":14364925.964999992,"d":"14,364,926 "}}]
[null,null,"Anteckningar",{"$nulls":10},0.3,0.9,0.9,0.9]
{"$rows_empty":9}
[{"$nulls":5},{"$f":"F42","v":{"v":3351816.058499999,"d":"3,351,816 "}},{"$f":"G42","v":{"v":2394154.3274999987,"d":"2,394,154 "}},{"v":4788308.6549999975,"d":"4,788,309 "}]
[]
[]
[4,null,"Välj nyttokategori: ",null,"Video - frigjorda vårdbesök","Trolig","Min","Max","Källa ",null,null,{"$f":"Startår","v":2019},{"$f":"L56+1","v":2020},{"$f":"M56+1","v":2021},{"$f":"N56+1","v":2022},{"$f":"O56+1","v":2023},{"$f":"P56+1","v":2024},"Summa"]
[null,null,"2. Omfördelningsnytta",null,"Besvarade invånarsamtal 1177 i snitt för 16 regioner som inför video",{"$f":"'Data antal samtal'!C23","v":{"v":2431777,"d":"2,431,777 "}},{"$f":"F57","v":{"v":2431777,"d":"2,431,777 "}},{"$f":"F57","v":{"v":2431777,"d":"2,431,777 "}},"Baseras på antal besvarade samtal för de 16 regionerna 2019",null,"Trolig",null,null,{"$f":"N60*$F$70","v":{"v":4356042.140099999,"d":"4,356,042 "}},{"$f":"O60*$F$70","v":{"v":13068126.420299996,"d":"13,068,126 "}},{"v":39204379.26089999,"d":"39,204,379 "},{"v":39204379.26089999,"d":"39,204,379 "},{"$f":"SUM(L57:Q57)","v":{"v":95832927.08219998,"d":"95,832,927 "}}]
[null,null,"Välj intressent: ",null,"Andel av samtalen som lämpar sig för video",{"v":0.07,"d":"7%"},{"v":0.05,"d":"5%"},{"v":0.1,"d":"10%"},"Bedömning utifrån piloterna och samtal med medicinskt sakkunnig. ",null,"Min",null,null,{"$f":"N60*$G$70","v":{"v":3111458.6715,"d":"3,111,459 "}},{"$f":"O60*$G$70","v":{"v":9334376.0145,"d":"9,334,376 "}},{"v":28003128.0435,"d":"28,003,128 "},{"v":28003128.0435,"d":"28,003,128 "},{"$f":"SUM(L58:Q58)","v":{"v":68452090.773,"d":"68,452,091 "}}]
[null,null,"Regioner",null,"Antal samtal lämpade för video per år",{"$f":"F58*F57","v":{"v":170224.39,"d":"170,224 "}},{"$f":"G58*G57","v":{"v":121588.85,"d":"121,589 "}},{"v":243177.7,"d":"243,178 "},null,null,"Max",null,null,{"$f":"N60*$H$70","v":{"v":5808056.186799999,"d":"5,808,056 "}},{"$f":"O60*$H$70","v":{"v":17424168.560399998,"d":"17,424,169 "}},{"v":52272505.6812,"d":"52,272,506 "},{"v":52272505.6812,"d":"52,272,506 "},{"$f":"SUM(L59:Q59)","v":{"v":127777236.1096,"d":"127,777,236 "}}]
[null,null,"Anteckningar",null,"Andel röstsamtal - lämpade för video - som får egenvårdsråd",{"v":0.27,"d":"27%"},{"v":0.27,"d":"27%"},{"v":0.39,"d":"39%"},"Resultat från bild- och videopiloter",{"$nulls":4},0.1,0.3,0.9,0.9]
[{"$nulls":4},"Antal röstsamtal - lämpade för video - som får egenvårdsråd",{"$f":"F60*F59","v":{"v":45960.585300000006,"d":"45,961 "}},{"$f":"G60*G59","v":{"v":32828.9895,"d":"32,829 "}},{"v":94839.30300000001,"d":"94,839 "}]
[{"$nulls":4},"Andel videosamtal - lämpade för video -  som får egenvårdsråd",{"v":0.42,"d":"42%"},{"v":0.42,"d":"42%"},{"v":0.53,"d":"53%"},"Resultat från bild- och videopiloter"]
[{"$nulls":4},"Antal videosamtal - lämpade för video -  som får egenvårdsråd",{"$f":"F62*F59","v":{"v":71494.2438,"d":"71,494 "}},{"$f":"G62*G59","v":{"v":51067.317,"d":"51,067 "}},{"v":128884.18100000001,"d":"128,884 "}]
[{"$nulls":4},"Antal besök i primärvården som kan undvikas genom att använda video",{"$f":"F63-F61","v":{"v":25533.65849999999,"d":"25,534 "}},{"$f":"G63-G61","v":{"v":18238.3275,"d":"18,238 "}},{"v":34044.878,"d":"34,045 "}]
[{"$nulls":4},"Regionens kostnad för ett besök i primärvården",{"v":1706,"d":"1,706 "},{"v":1706,"d":"1,706 "},{"v":1706,"d":"1,706 "},"Vården i siffror"]
[]
[]
[]
[]
[{"$nulls":5},{"$f":"F65*F64","v":{"v":43560421.400999986,"d":"43,560,421 "}},{"$f":"G65*G64","v":{"v":31114586.715,"d":"31,114,587 "}},{"v":58080561.86799999,"d":"58,080,562 "}]
[]
[]
[5,null,"Välj nyttokategori: ",null,"Video - sparar tid","Trolig","Min","Max","Källa ",null,null,{"$f":"Startår","v":2019},{"$f":"L73+1","v":2020},{"$f":"M73+1","v":2021},{"$f":"N73+1","v":2022},{"$f":"O73+1","v":2023},{"$f":"P73+1","v":2024},"Summa"]
[null,null,"2. Omfördelningsnytta",null,"Antal besök i primärvården som kan undvikas genom att använda bild",{"$f":"F64","v":{"v":25533.65849999999,"d":"25,534 "}},{"$f":"G64","v":{"v":18238.3275,"d":"18,238 "}},{"v":34044.878,"d":"34,045 "},null,null,"Trolig",null,null,{"$f":"N77*$F$87","v":{"v":653916.9941849998,"d":"653,917 "}},{"$f":"O77*$F$87","v":{"v":1961750.9825549994,"d":"1,961,751 "}},{"v":5885252.9476649985,"d":"5,885,253 "},{"v":5885252.9476649985,"d":"5,885,253 "},{"$f":"SUM(L74:Q74)","v":{"v":14386173.872069996,"d":"14,386,174 "}}]
[null,null,"Välj intressent: ",null,"Snittrestid tur och retur vårdmottagning (timmar)",{"v":0.3,"d":"0.3 "},{"v":0.3,"d":"0.3 "},{"v":0.3,"d":"0.3 "},null,null,"Min",null,null,{"$f":"N77*$G$87","v":{"v":359295.05175000004,"d":"359,295 "}},{"$f":"O77*$G$87","v":{"v":1077885.15525,"d":"1,077,885 "}},{"v":3233655.46575,"d":"3,233,655 "},{"v":3233655.46575,"d":"3,233,655 "},{"$f":"SUM(L75:Q75)","v":{"v":7904491.138499999,"d":"7,904,491 "}}]
[null,null,"Invånare",null,"Snittid på vårdmottagning (timmar)",{"v":1,"d":"1 "},{"v":1,"d":"1 "},{"v":1,"d":"1 "},null,null,"Max",null,null,{"$f":"N77*$H$87","v":{"v":670684.0965999999,"d":"670,684 "}},{"$f":"O77*$H$87","v":{"v":2012052.2897999997,"d":"2,012,052 "}},{"v":6036156.869399999,"d":"6,036,157 "},{"v":6036156.869399999,"d":"6,036,157 "},{"$f":"SUM(L76:Q76)","v":{"v":14755050.1252,"d":"14,755,050 "}}]
[null,null,"Anteckningar",null,"Värdering av tid för vårdbesök för invånaren",{"v":197,"d":"197 "},{"v":197,"d":"197 "},{"v":197,"d":"197 "},{"$nulls":5},0.1,0.3,0.9,0.9]
[{"$nulls":4},"Sparad tid",{"$f":"(F75+F76)*F74*F77","v":{"v":6539169.941849998,"d":"6,539,170 "}},{"$f":"(G75+G76)*G74*G77","v":{"v":4670835.67275,"d":"4,670,836 "}},{"v":8718893.2558,"d":"8,718,893 "}]
{"$rows_empty":8}
[{"$nulls":5},{"$f":"F78","v":{"v":6539169.941849998,"d":"6,539,170 "}},{"$f":"G77*G74","v":{"v":3592950.5175,"d":"3,592,951 "}},{"$f":"H77*H74","v":{"v":6706840.965999999,"d":"6,706,841 "}}]
[]
[]
[6,null,"Välj nyttokategori: ",null,"Video - sparar pengar","Trolig","Min","Max","Källa ",null,null,{"$f":"Startår","v":2019},{"$f":"L90+1","v":2020},{"$f":"M90+1","v":2021},{"$f":"N90+1","v":2022},{"$f":"O90+1","v":2023},{"$f":"P90+1","v":2024},"Summa"]
[null,null,"1. Finansiell",null,{"$f":"E64","v":"Antal besök i primärvården som kan undvikas genom att använda video"},{"$f":"F64","v":{"v":25533.65849999999,"d":"25,534 "}},{"v":18238.3275,"d":"18,238 "},{"v":34044.878,"d":"34,045 "},null,null,"Trolig",null,null,{"$f":"N94*$F$104","v":{"v":497906.3407499998,"d":"497,906 "}},{"$f":"O94*$F$104","v":{"v":1493719.0222499992,"d":"1,493,719 "}},{"v":4481157.066749998,"d":"4,481,157 "},{"v":4481157.066749998,"d":"4,481,157 "},{"$f":"SUM(L91:Q91)","v":{"v":10953939.496499997,"d":"10,953,939 "}}]
[null,null,"Välj intressent: ",null,"Patientavgift för ett besök i primärvården",{"v":195,"d":"195 "},{"v":195,"d":"195 "},{"v":195,"d":"195 "},null,null,"Min",null,null,{"$f":"N94*$G$104","v":{"v":355647.38625,"d":"355,647 "}},{"$f":"O94*$G$104","v":{"v":1066942.15875,"d":"1,066,942 "}},{"v":3200826.47625,"d":"3,200,826 "},{"v":3200826.47625,"d":"3,200,826 "},{"$f":"SUM(L92:Q92)","v":{"v":7824242.4975000005,"d":"7,824,242 "}}]
[null,null,"Invånare",null,"Sparade pengar",{"$f":"F92*F91","v":{"v":4979063.407499998,"d":"4,979,063 "}},{"$f":"G92*G91","v":{"v":3556473.8625,"d":"3,556,474 "}},{"v":6638751.209999999,"d":"6,638,751 "},null,null,"Max",null,null,{"$f":"N94*$H$104","v":{"v":663875.1209999999,"d":"663,875 "}},{"$f":"O94*$H$104","v":{"v":1991625.3629999997,"d":"1,991,625 "}},{"v":5974876.089,"d":"5,974,876 "},{"v":5974876.089,"d":"5,974,876 "},{"$f":"SUM(L93:Q93)","v":{"v":14605252.661999999,"d":"14,605,253 "}}]
[null,null,"Anteckningar",{"$nulls":10},0.1,0.3,0.9,0.9]
{"$rows_empty":9}
[{"$nulls":5},{"$f":"F93","v":{"v":4979063.407499998,"d":"4,979,063 "}},{"$f":"G93","v":{"v":3556473.8625,"d":"3,556,474 "}},{"v":6638751.209999999,"d":"6,638,751 "}]
[]
[]
[7,null,"Välj nyttokategori: ",null,null,"Trolig","Min","Max","Källa ",null,null,{"$f":"Startår","v":2019},{"$f":"L107+1","v":2020},{"$f":"M107+1","v":2021},{"$f":"N107+1","v":2022},{"$f":"O107+1","v":2023},{"$f":"P107+1","v":2024},"Summa"]
[{"$nulls":10},"Trolig",{"$nulls":6},{"$f":"SUM(L108:Q108)","v":0}]
[null,null,"Välj intressent: ",{"$nulls":7},"Min",{"$nulls":6},{"$f":"SUM(L109:Q109)","v":0}]
[{"$nulls":10},"Max",{"$nulls":6},{"$f":"SUM(L110:Q110)","v":0}]
[null,null,"Anteckningar"]
{"$rows_empty":9}
[{"$nulls":5},{"$f":"F114*F112","v":0}]
[]
[]
[8,null,"Välj nyttokategori: ",null,null,"Trolig","Min","Max","Källa ",null,null,{"$f":"Startår","v":2019},{"$f":"L124+1","v":2020},{"$f":"M124+1","v":2021},{"$f":"N124+1","v":2022},{"$f":"O124+1","v":2023},{"$f":"P124+1","v":2024},"Summa"]
[{"$nulls":10},"Trolig",{"$nulls":6},{"$f":"SUM(L125:Q125)","v":0}]
[null,null,"Välj intressent: ",{"$nulls":7},"Min",{"$nulls":6},{"$f":"SUM(L126:Q126)","v":0}]
[{"$nulls":10},"Max",{"$nulls":6},{"$f":"SUM(L127:Q127)","v":0}]
[null,null,"Anteckningar"]
{"$rows_empty":12}
[9,null,"Välj nyttokategori: ",null,null,"Trolig","Min","Max","Källa ",null,null,{"$f":"Startår","v":2019},{"$f":"L141+1","v":2020},{"$f":"M141+1","v":2021},{"$f":"N141+1","v":2022},{"$f":"O141+1","v":2023},{"$f":"P141+1","v":2024},"Summa"]
[{"$nulls":10},"Trolig",{"$nulls":6},{"$f":"SUM(L142:Q142)","v":0}]
[null,null,"Välj intressent: ",{"$nulls":7},"Min",{"$nulls":6},{"$f":"SUM(L143:Q143)","v":0}]
[{"$nulls":10},"Max",{"$nulls":6},{"$f":"SUM(L144:Q144)","v":0}]
[null,null,"Anteckningar"]
{"$rows_empty":12}
[10,null,"Välj nyttokategori: ",null,null,"Trolig","Min","Max","Källa ",null,null,{"$f":"Startår","v":2019},{"$f":"L158+1","v":2020},{"$f":"M158+1","v":2021},{"$f":"N158+1","v":2022},{"$f":"O158+1","v":2023},{"$f":"P158+1","v":2024},"Summa"]
[{"$nulls":10},"Trolig",{"$nulls":6},{"$f":"SUM(L159:Q159)","v":0}]
[null,null,"Välj intressent: ",{"$nulls":7},"Min",{"$nulls":6},{"$f":"SUM(L160:Q160)","v":0}]
[{"$nulls":10},"Max",{"$nulls":6},{"$f":"SUM(L161:Q161)","v":0}]
[null,null,"Anteckningar"]
{"$rows_empty":12}
[11,null,"Välj nyttokategori: ",null,null,"Trolig","Min","Max","Källa ",null,null,{"$f":"Startår","v":2019},{"$f":"L175+1","v":2020},{"$f":"M175+1","v":2021},{"$f":"N175+1","v":2022},{"$f":"O175+1","v":2023},{"$f":"P175+1","v":2024},"Summa"]
[{"$nulls":10},"Trolig",{"$nulls":6},{"$f":"SUM(L176:Q176)","v":0}]
[null,null,"Välj intressent: ",{"$nulls":7},"Min",{"$nulls":6},{"$f":"SUM(L177:Q177)","v":0}]
[{"$nulls":10},"Max",{"$nulls":6},{"$f":"SUM(L178:Q178)","v":0}]
[null,null,"Anteckningar"]
{"$rows_empty":12}
[12,null,"Välj nyttokategori: ",null,null,"Trolig","Min","Max","Källa ",null,null,{"$f":"Startår","v":2019},{"$f":"L192+1","v":2020},{"$f":"M192+1","v":2021},{"$f":"N192+1","v":2022},{"$f":"O192+1","v":2023},{"$f":"P192+1","v":2024},"Summa"]
[{"$nulls":10},"Trolig",{"$nulls":6},{"$f":"SUM(L193:Q193)","v":0}]
[null,null,"Välj intressent: ",{"$nulls":7},"Min",{"$nulls":6},{"$f":"SUM(L194:Q194)","v":0}]
[{"$nulls":10},"Max",{"$nulls":6},{"$f":"SUM(L195:Q195)","v":0}]
[null,null,"Anteckningar"]
{"$rows_empty":12}
[13,null,"Välj nyttokategori: ",null,null,"Trolig","Min","Max","Källa ",null,null,{"$f":"Startår","v":2019},{"$f":"L209+1","v":2020},{"$f":"M209+1","v":2021},{"$f":"N209+1","v":2022},{"$f":"O209+1","v":2023},{"$f":"P209+1","v":2024},"Summa"]
[{"$nulls":10},"Trolig",{"$nulls":6},{"$f":"SUM(L210:Q210)","v":0}]
[null,null,"Välj intressent: ",{"$nulls":7},"Min",{"$nulls":6},{"$f":"SUM(L211:Q211)","v":0}]
[{"$nulls":10},"Max",{"$nulls":6},{"$f":"SUM(L212:Q212)","v":0}]
[null,null,"Anteckningar"]
{"$rows_empty":12}
[14,null,"Välj nyttokategori: ",null,null,"Trolig","Min","Max","Källa ",null,null,{"$f":"Startår","v":2019},{"$f":"L226+1","v":2020},{"$f":"M226+1","v":2021},{"$f":"N226+1","v":2022},{"$f":"O226+1","v":2023},{"$f":"P226+1","v":2024},"Summa"]
[{"$nulls":10},"Trolig",{"$nulls":6},{"$f":"SUM(L227:Q227)","v":0}]
[null,null,"Välj intressent: ",{"$nulls":7},"Min",{"$nulls":6},{"$f":"SUM(L228:Q228)","v":0}]
[{"$nulls":10},"Max",{"$nulls":6},{"$f":"SUM(L229:Q229)","v":0}]
[null,null,"Anteckningar"]
{"$rows_empty":12}
[15,null,"Välj nyttokategori: ",null,null,"Trolig","Min","Max","Källa ",null,null,{"$f":"Startår","v":2019},{"$f":"L243+1","v":2020},{"$f":"M243+1","v":2021},{"$f":"N243+1","v":2022},{"$f":"O243+1","v":2023},{"$f":"P243+1","v":2024},"Summa"]
[{"$nulls":10},"Trolig",{"$nulls":6},{"$f":"SUM(L244:Q244)","v":0}]
[null,null,"Välj intressent: ",{"$nulls":7},"Min",{"$nulls":6},{"$f":"SUM(L245:Q245)","v":0}]
[{"$nulls":10},"Max",{"$nulls":6},{"$f":"SUM(L246:Q246)","v":0}]
[null,null,"Anteckningar"]
{"$rows_empty":12}
[16,null,"Välj nyttokategori: ",null,null,"Trolig","Min","Max","Källa ",null,null,{"$f":"Startår","v":2019},{"$f":"L260+1","v":2020},{"$f":"M260+1","v":2021},{"$f":"N260+1","v":2022},{"$f":"O260+1","v":2023},{"$f":"P260+1","v":2024},"Summa"]
[{"$nulls":10},"Trolig",{"$nulls":6},{"$f":"SUM(L261:Q261)","v":0}]
[null,null,"Välj intressent: ",{"$nulls":7},"Min",{"$nulls":6},{"$f":"SUM(L262:Q262)","v":0}]
[{"$nulls":10},"Max",{"$nulls":6},{"$f":"SUM(L263:Q263)","v":0}]
[null,null,"Anteckningar"]
{"$rows_empty":12}
[17,null,"Välj nyttokategori: ",null,null,"Trolig","Min","Max","Källa ",null,null,{"$f":"Startår","v":2019},{"$f":"L277+1","v":2020},{"$f":"M277+1","v":2021},{"$f":"N277+1","v":2022},{"$f":"O277+1","v":2023},{"$f":"P277+1","v":2024},"Summa"]
[{"$nulls":10},"Trolig",{"$nulls":6},{"$f":"SUM(L278:Q278)","v":0}]
[null,null,"Välj intressent: ",{"$nulls":7},"Min",{"$nulls":6},{"$f":"SUM(L279:Q279)","v":0}]
[{"$nulls":10},"Max",{"$nulls":6},{"$f":"SUM(L280:Q280)","v":0}]
[null,null,"Anteckningar"]
{"$rows_empty":12}
[18,null,"Välj nyttokategori: ",null,null,"Trolig","Min","Max","Källa ",null,null,{"$f":"Startår","v":2019},{"$f":"L294+1","v":2020},{"$f":"M294+1","v":2021},{"$f":"N294+1","v":2022},{"$f":"O294+1","v":2023},{"$f":"P294+1","v":2024},"Summa"]
[{"$nulls":10},"Trolig",{"$nulls":6},{"$f":"SUM(L295:Q295)","v":0}]
[null,null,"Välj intressent: ",{"$nulls":7},"Min",{"$nulls":6},{"$f":"SUM(L296:Q296)","v":0}]
[{"$nulls":10},"Max",{"$nulls":6},{"$f":"SUM(L297:Q297)","v":0}]
[null,null,"Anteckningar"]
{"$rows_empty":12}
[19,null,"Välj nyttokategori: ",null,null,"Trolig","Min","Max","Källa ",null,null,{"$f":"Startår","v":2019},{"$f":"L311+1","v":2020},{"$f":"M311+1","v":2021},{"$f":"N311+1","v":2022},{"$f":"O311+1","v":2023},{"$f":"P311+1","v":2024},"Summa"]
[{"$nulls":10},"Trolig",{"$nulls":6},{"$f":"SUM(L312:Q312)","v":0}]
[null,null,"Välj intressent: ",{"$nulls":7},"Min",{"$nulls":6},{"$f":"SUM(L313:Q313)","v":0}]
[{"$nulls":10},"Max",{"$nulls":6},{"$f":"SUM(L314:Q314)","v":0}]
[null,null,"Anteckningar"]
{"$rows_empty":12}
[20,null,"Välj nyttokategori: ",null,null,"Trolig","Min","Max","Källa ",null,null,{"$f":"Startår","v":2019},{"$f":"L328+1","v":2020},{"$f":"M328+1","v":2021},{"$f":"N328+1","v":2022},{"$f":"O328+1","v":2023},{"$f":"P328+1","v":2024},"Summa"]
[{"$nulls":10},"Trolig",{"$nulls":6},{"$f":"SUM(L329:Q329)","v":0}]
[null,null,"Välj intressent: ",{"$nulls":7},"Min",{"$nulls":6},{"$f":"SUM(L330:Q330)","v":0}]
[{"$nulls":10},"Max",{"$nulls":6},{"$f":"SUM(L331:Q331)","v":0}]
[null,null,"Anteckningar"]
{"$rows_empty":12}
[21,null,"Välj nyttokategori: ",null,null,"Trolig","Min","Max","Källa ",null,null,{"$f":"Startår","v":2019},{"$f":"L345+1","v":2020},{"$f":"M345+1","v":2021},{"$f":"N345+1","v":2022},{"$f":"O345+1","v":2023},{"$f":"P345+1","v":2024},"Summa"]
[{"$nulls":10},"Trolig",{"$nulls":6},{"$f":"SUM(L346:Q346)","v":0}]
[null,null,"Välj intressent: ",{"$nulls":7},"Min",{"$nulls":6},{"$f":"SUM(L347:Q347)","v":0}]
[{"$nulls":10},"Max",{"$nulls":6},{"$f":"SUM(L348:Q348)","v":0}]
[null,null,"Anteckningar"]

{"sheet":"Nyttor","index":2,"n_rows":29,"n_cols":34,"rows_kept":29,"merged":[[0,3,0,5],[3,5,3,10],[3,17,3,24],[3,26,3,33]]}
[null,"Nyttor"]
[null,{"$f":"IF(Försättsblad!B6=0,\"\",Försättsblad!B6)","v":"Första linjens digitala vård - nya kanaler - bild och video"}]
[]
[{"$nulls":5},"Diskontering (justeras under 'Diskonteringsränta' på Försättsbladet)",{"$nulls":11},"Min-värden med diskontering",{"$nulls":8},"Max-värden med diskontering"]
[{"$nulls":5},{"$f":"(1+Diskonteringsränta)^0","v":{"v":1,"d":"1.000 "}},{"$f":"(1+Diskonteringsränta)^1","v":{"v":1.03,"d":"1.030 "}},{"$f":"(1+Diskonteringsränta)^2","v":{"v":1.0609,"d":"1.061 "}},{"$f":"(1+Diskonteringsränta)^3","v":{"v":1.092727,"d":"1.093 "}},{"$f":"(1+Diskonteringsränta)^4","v":{"v":1.12550881,"d":"1.126 "}},{"$f":"(1+Diskonteringsränta)^5","v":{"v":1.1592740742999998,"d":"1.159 "}},{"$nulls":7},{"$f":"F5","v":{"v":1,"d":"1.000 "}},{"$f":"G5","v":{"v":1.03,"d":"1.030 "}},{"v":1.0609,"d":"1.061 "},{"v":1.092727,"d":"1.093 "},{"v":1.12550881,"d":"1.126 "},{"v":1.1592740742999998,"d":"1.159 "},{"$nulls":3},{"$f":"F5","v":{"v":1,"d":"1.000 "}},{"$f":"G5","v":{"v":1.03,"d":"1.030 "}},{"v":1.0609,"d":"1.061 "},{"v":1.092727,"d":"1.093 "},{"v":1.12550881,"d":"1.126 "},{"v":1.1592740742999998,"d":"1.159 "}]
[{"$nulls":5},{"$f":"Startår","v":2019},{"$f":"F6+1","v":2020},{"$f":"G6+1","v":2021},{"$f":"H6+1","v":2022},2023,2024]
[null,"ID","Nyttokategori","Nyttans namn","Intressent ","År 1","År 2","År 3","År 4","År 5","År 6","Summa trolig","Summa min","Summa max","Vägt medel","Osäkerhet",null,"ID","År 1","År 2","År 3","År 4","År 5","År 6","Summa",null,"ID","År 1","År 2","År 3","År 4","År 5","År 6","Summa"]
[null,1,{"$f":"'Räkna på nyttorna'!C6","v":"2. Omfördelningsnytta"},{"$f":"'Räkna på nyttorna'!E5","v":"Bild - frigjorda vårdbesök"},{"$f":"'Räkna på nyttorna'!C8","v":"Regioner"},{"$f":"'Räkna på nyttorna'!L6/F5","v":0},{"$f":"'Räkna på nyttorna'!M6/G5","v":0},{"$f":"'Räkna på nyttorna'!N6/H5","v":{"v":8292231.118427747,"d":"8,292,231 "}},{"$f":"'Räkna på nyttorna'!O6/I5","v":{"v":24152129.47114878,"d":"24,152,129 "}},{"$f":"'Räkna på nyttorna'!P6/J5","v":{"v":23448669.389464837,"d":"23,448,669 "}},{"$f":"'Räkna på nyttorna'!Q6/K5","v":{"v":22765698.43637363,"d":"22,765,698 "}},{"$f":"SUM(Nyttor[[#This Row],[År 1]:[År 6]])","v":{"v":78658728.41541499,"d":"78,658,728 "}},{"$f":"NyttorMin[[#This Row],[Summa]]","v":{"v":56184806.01101071,"d":"56,184,806 "}},{"$f":"NyttorMax[[#This Row],[Summa]]","v":{"v":112369612.02202141,"d":"112,369,612 "}},{"$f":"IF(OR(ISBLANK(N8),ISBLANK(M8),ISBLANK(L8)),\"\",(N8+M8+3*L8)/5)","v":{"v":80906120.65585542,"d":"80,906,121 "}},{"$f":"IF(OR(ISBLANK(L8),L8=0),\"\",(N8-M8)/5/L8)","v":{"v":0.14285714285714285,"d":"14%"}},null,{"$f":"B8","v":1},{"$f":"'Räkna på nyttorna'!L7/S5","v":0},{"$f":"'Räkna på nyttorna'!M7/T5","v":0},{"$f":"'Räkna på nyttorna'!N7/U5","v":{"v":5923022.227448391,"d":"5,923,022 "}},{"$f":"'Räkna på nyttorna'!O7/V5","v":{"v":17251521.050820556,"d":"17,251,521 "}},{"$f":"'Räkna på nyttorna'!P7/W5","v":{"v":16749049.563903453,"d":"16,749,050 "}},{"$f":"'Räkna på nyttorna'!Q7/X5","v":{"v":16261213.168838304,"d":"16,261,213 "}},{"$f":"SUM(NyttorMin[[#This Row],[År 1]:[År 6]])","v":{"v":56184806.01101071,"d":"56,184,806 "}},null,1,{"$f":"'Räkna på nyttorna'!L8/AB5","v":0},{"$f":"'Räkna på nyttorna'!M8/AC5","v":0},{"$f":"'Räkna på nyttorna'!N8/AD5","v":{"v":11846044.454896782,"d":"11,846,044 "}},{"$f":"'Räkna på nyttorna'!O8/AE5","v":{"v":34503042.10164111,"d":"34,503,042 "}},{"$f":"'Räkna på nyttorna'!P8/AF5","v":{"v":33498099.127806906,"d":"33,498,099 "}},{"$f":"'Räkna på nyttorna'!Q8/AG5","v":{"v":32522426.337676607,"d":"32,522,426 "}},{"$f":"SUM(NyttorMax[[#This Row],[År 1]:[År 6]])","v":{"v":112369612.02202141,"d":"112,369,612 "}}]
[null,2,{"$f":"'Räkna på nyttorna'!C23","v":"2. Omfördelningsnytta"},{"$f":"'Räkna på nyttorna'!E22","v":"Bild - sparar tid för invånare"},{"$f":"'Räkna på nyttorna'!C25","v":"Invånare"},{"$f":"'Räkna på nyttorna'!L23/F5","v":0},{"$f":"'Räkna på nyttorna'!M23/G5","v":0},{"$f":"'Räkna på nyttorna'!N23/H5","v":{"v":1244806.7933349041,"d":"1,244,807 "}},{"$f":"'Räkna på nyttorna'!O23/I5","v":{"v":3625650.8543735077,"d":"3,625,651 "}},{"$f":"'Räkna på nyttorna'!P23/J5","v":{"v":3520049.373178163,"d":"3,520,049 "}},{"$f":"'Räkna på nyttorna'!Q23/K5","v":{"v":3417523.66327977,"d":"3,417,524 "}},{"$f":"SUM(Nyttor[[#This Row],[År 1]:[År 6]])","v":{"v":11808030.684166346,"d":"11,808,031 "}},{"$f":"NyttorMin[[#This Row],[Summa]]","v":{"v":6487928.947344142,"d":"6,487,929 "}},{"$f":"NyttorMax[[#This Row],[Summa]]","v":{"v":12975857.894688284,"d":"12,975,858 "}},{"v":10977575.778906293,"d":"10,977,576 "},{"v":0.10989010989010982,"d":"11%"},null,2,{"$f":"'Räkna på nyttorna'!L24/S5","v":0},{"$f":"'Räkna på nyttorna'!M24/T5","v":0},{"$f":"'Räkna på nyttorna'!N24/U5","v":{"v":683959.7765576395,"d":"683,960 "}},{"$f":"'Räkna på nyttorna'!O24/V5","v":{"v":1992115.8540513767,"d":"1,992,116 "}},{"$f":"'Räkna på nyttorna'!P24/W5","v":{"v":1934093.062185803,"d":"1,934,093 "}},{"$f":"'Räkna på nyttorna'!Q24/X5","v":{"v":1877760.2545493233,"d":"1,877,760 "}},{"$f":"SUM(NyttorMin[[#This Row],[År 1]:[År 6]])","v":{"v":6487928.947344142,"d":"6,487,929 "}},null,2,{"$f":"'Räkna på nyttorna'!L25/AB5","v":0},{"$f":"'Räkna på nyttorna'!M25/AC5","v":0},{"$f":"'Räkna på nyttorna'!N25/AD5","v":{"v":1367919.553115279,"d":"1,367,920 "}},{"$f":"'Räkna på nyttorna'!O25/AE5","v":{"v":3984231.7081027534,"d":"3,984,232 "}},{"$f":"'Räkna på nyttorna'!P25/AF5","v":{"v":3868186.124371606,"d":"3,868,186 "}},{"$f":"'Räkna på nyttorna'!Q25/AG5","v":{"v":3755520.5090986467,"d":"3,755,521 "}},{"$f":"SUM(NyttorMax[[#This Row],[År 1]:[År 6]])","v":{"v":12975857.894688284,"d":"12,975,858 "}}]
[null,3,{"$f":"'Räkna på nyttorna'!C40","v":"1. Finansiell"},{"$f":"'Räkna på nyttorna'!E39","v":"Bild - sparar pengar för invånare"},"Invånare",{"$f":"'Räkna på nyttorna'!L40/F5","v":0},{"$f":"'Räkna på nyttorna'!M40/G5","v":0},{"$f":"'Räkna på nyttorna'!N40/H5","v":{"v":947822.431473277,"d":"947,822 "}},{"$f":"'Räkna på nyttorna'!O40/I5","v":{"v":2760647.85866003,"d":"2,760,648 "}},{"$f":"'Räkna på nyttorna'!P40/J5","v":{"v":2680240.6394757577,"d":"2,680,241 "}},{"$f":"'Räkna på nyttorna'!Q40/K5","v":{"v":2602175.378131804,"d":"2,602,175 "}},{"$f":"SUM(Nyttor[[#This Row],[År 1]:[År 6]])","v":{"v":8990886.307740869,"d":"8,990,886 "}},{"$f":"NyttorMin[[#This Row],[Summa]]","v":{"v":6422061.648386335,"d":"6,422,062 "}},{"$f":"NyttorMax[[#This Row],[Summa]]","v":{"v":12844123.29677267,"d":"12,844,123 "}},{"v":9247768.773676323,"d":"9,247,769 "},{"v":0.14285714285714285,"d":"14%"},null,3,{"$f":"'Räkna på nyttorna'!L41/S5","v":0},{"$f":"'Räkna på nyttorna'!M41/T5","v":0},{"$f":"'Räkna på nyttorna'!N41/U5","v":{"v":677016.0224809122,"d":"677,016 "}},{"$f":"'Räkna på nyttorna'!O41/V5","v":{"v":1971891.3276143072,"d":"1,971,891 "}},{"$f":"'Räkna på nyttorna'!P41/W5","v":{"v":1914457.5996255411,"d":"1,914,458 "}},{"$f":"'Räkna på nyttorna'!Q41/X5","v":{"v":1858696.698665574,"d":"1,858,697 "}},{"$f":"SUM(NyttorMin[[#This Row],[År 1]:[År 6]])","v":{"v":6422061.648386335,"d":"6,422,062 "}},null,3,{"$f":"'Räkna på nyttorna'!L42/AB5","v":0},{"$f":"'Räkna på nyttorna'!M42/AC5","v":0},{"$f":"'Räkna på nyttorna'!N42/AD5","v":{"v":1354032.0449618243,"d":"1,354,032 "}},{"$f":"'Räkna på nyttorna'!O42/AE5","v":{"v":3943782.6552286143,"d":"3,943,783 "}},{"$f":"'Räkna på nyttorna'!P42/AF5","v":{"v":3828915.1992510823,"d":"3,828,915 "}},{"$f":"'Räkna på nyttorna'!Q42/AG5","v":{"v":3717393.397331148,"d":"3,717,393 "}},{"$f":"SUM(NyttorMax[[#This Row],[År 1]:[År 6]])","v":{"v":12844123.29677267,"d":"12,844,123 "}}]
[null,4,{"$f":"'Räkna på nyttorna'!C57","v":"2. Omfördelningsnytta"},{"$f":"'Räkna på nyttorna'!E56","v":"Video - frigjorda vårdbesök"},{"$f":"'Räkna på nyttorna'!C59","v":"Regioner"},{"$f":"'Räkna på nyttorna'!L57/F5","v":0},{"$f":"'Räkna på nyttorna'!M57/G5","v":0},{"$f":"'Räkna på nyttorna'!N57/H5","v":{"v":4105987.5012725033,"d":"4,105,988 "}},{"$f":"'Räkna på nyttorna'!O57/I5","v":{"v":11959186.896910204,"d":"11,959,187 "}},{"$f":"'Räkna på nyttorna'!P57/J5","v":{"v":34832583.19488409,"d":"34,832,583 "}},{"$f":"'Räkna på nyttorna'!Q57/K5","v":{"v":33818041.936780676,"d":"33,818,042 "}},{"$f":"SUM(Nyttor[[#This Row],[År 1]:[År 6]])","v":{"v":84715799.52984747,"d":"84,715,800 "}},{"$f":"NyttorMin[[#This Row],[Summa]]","v":{"v":60511285.37846249,"d":"60,511,285 "}},{"$f":"NyttorMax[[#This Row],[Summa]]","v":{"v":112954399.37313,"d":"112,954,399 "}},{"v":85522616.66822699,"d":"85,522,617 "},{"v":0.12380952380952386,"d":"12%"},null,4,{"$f":"'Räkna på nyttorna'!L58/S5","v":0},{"$f":"'Räkna på nyttorna'!M58/T5","v":0},{"$f":"'Räkna på nyttorna'!N58/U5","v":{"v":2932848.2151946463,"d":"2,932,848 "}},{"$f":"'Räkna på nyttorna'!O58/V5","v":{"v":8542276.354935862,"d":"8,542,276 "}},{"$f":"'Räkna på nyttorna'!P58/W5","v":{"v":24880416.567774355,"d":"24,880,417 "}},{"$f":"'Räkna på nyttorna'!Q58/X5","v":{"v":24155744.24055763,"d":"24,155,744 "}},{"$f":"SUM(NyttorMin[[#This Row],[År 1]:[År 6]])","v":{"v":60511285.37846249,"d":"60,511,285 "}},null,4,{"$f":"'Räkna på nyttorna'!L59/AB5","v":0},{"$f":"'Räkna på nyttorna'!M59/AC5","v":0},{"$f":"'Räkna på nyttorna'!N59/AD5","v":{"v":5474650.001696672,"d":"5,474,650 "}},{"$f":"'Räkna på nyttorna'!O59/AE5","v":{"v":15945582.529213607,"d":"15,945,583 "}},{"$f":"'Räkna på nyttorna'!P59/AF5","v":{"v":46443444.259845465,"d":"46,443,444 "}},{"$f":"'Räkna på nyttorna'!Q59/AG5","v":{"v":45090722.582374245,"d":"45,090,723 "}},{"$f":"SUM(NyttorMax[[#This Row],[År 1]:[År 6]])","v":{"v":112954399.37313,"d":"112,954,399 "}}]
[null,5,{"$f":"'Räkna på nyttorna'!C74","v":"2. Omfördelningsnytta"},{"$f":"'Räkna på nyttorna'!E73","v":"Video - sparar tid"},{"$f":"'Räkna på nyttorna'!C76","v":"Invånare"},{"$f":"'Räkna på nyttorna'!L74/F5","v":0},{"$f":"'Räkna på nyttorna'!M74/G5","v":0},{"$f":"'Räkna på nyttorna'!N74/H5","v":{"v":616379.4836318219,"d":"616,379 "}},{"$f":"'Räkna på nyttorna'!O74/I5","v":{"v":1795280.0494130733,"d":"1,795,280 "}},{"$f":"'Räkna på nyttorna'!P74/J5","v":{"v":5228971.017707981,"d":"5,228,971 "}},{"$f":"'Räkna på nyttorna'!Q74/K5","v":{"v":5076670.890978623,"d":"5,076,671 "}},{"$f":"SUM(Nyttor[[#This Row],[År 1]:[År 6]])","v":{"v":12717301.4417315,"d":"12,717,301 "}},{"$f":"NyttorMin[[#This Row],[Summa]]","v":{"v":6987528.264687639,"d":"6,987,528 "}},{"$f":"NyttorMax[[#This Row],[Summa]]","v":{"v":13043386.09408359,"d":"13,043,386 "}},{"v":11636563.736793146,"d":"11,636,564 "},{"v":0.09523809523809523,"d":"10%"},null,5,{"$f":"'Räkna på nyttorna'!L75/S5","v":0},{"$f":"'Räkna på nyttorna'!M75/T5","v":0},{"$f":"'Räkna på nyttorna'!N75/U5","v":{"v":338670.04595155065,"d":"338,670 "}},{"$f":"'Räkna på nyttorna'!O75/V5","v":{"v":986417.6095676231,"d":"986,418 "}},{"$f":"'Räkna på nyttorna'!P75/W5","v":{"v":2873060.99874065,"d":"2,873,061 "}},{"$f":"'Räkna på nyttorna'!Q75/X5","v":{"v":2789379.6104278155,"d":"2,789,380 "}},{"$f":"SUM(NyttorMin[[#This Row],[År 1]:[År 6]])","v":{"v":6987528.264687639,"d":"6,987,528 "}},null,5,{"$f":"'Räkna på nyttorna'!L76/AB5","v":0},{"$f":"'Räkna på nyttorna'!M76/AC5","v":0},{"$f":"'Räkna på nyttorna'!N76/AD5","v":{"v":632184.0857762276,"d":"632,184 "}},{"$f":"'Räkna på nyttorna'!O76/AE5","v":{"v":1841312.871192896,"d":"1,841,313 "}},{"$f":"'Räkna på nyttorna'!P76/AF5","v":{"v":5363047.197649213,"d":"5,363,047 "}},{"$f":"'Räkna på nyttorna'!Q76/AG5","v":{"v":5206841.939465255,"d":"5,206,842 "}},{"$f":"SUM(NyttorMax[[#This Row],[År 1]:[År 6]])","v":{"v":13043386.09408359,"d":"13,043,386 "}}]
[null,6,{"$f":"'Räkna på nyttorna'!C91","v":"1. Finansiell"},{"$f":"'Räkna på nyttorna'!E90","v":"Video - sparar pengar"},{"$f":"'Räkna på nyttorna'!C93","v":"Invånare"},{"$f":"'Räkna på nyttorna'!L91/F5","v":0},{"$f":"'Räkna på nyttorna'!M91/G5","v":0},{"$f":"'Räkna på nyttorna'!N91/H5","v":{"v":469324.47992270696,"d":"469,324 "}},{"$f":"'Räkna på nyttorna'!O91/I5","v":{"v":1366964.5046292434,"d":"1,366,965 "}},{"$f":"'Räkna på nyttorna'!P91/J5","v":{"v":3981450.013483234,"d":"3,981,450 "}},{"$f":"'Räkna på nyttorna'!Q91/K5","v":{"v":3865485.4499837225,"d":"3,865,485 "}},{"$f":"SUM(Nyttor[[#This Row],[År 1]:[År 6]])","v":{"v":9683224.448018909,"d":"9,683,224 "}},{"$f":"NyttorMin[[#This Row],[Summa]]","v":{"v":6916588.891442079,"d":"6,916,589 "}},{"$f":"NyttorMax[[#This Row],[Summa]]","v":{"v":12910965.93069188,"d":"12,910,966 "}},{"v":9775445.633238137,"d":"9,775,446 "},{"v":0.1238095238095238,"d":"12%"},null,6,{"$f":"'Räkna på nyttorna'!L92/S5","v":0},{"$f":"'Räkna på nyttorna'!M92/T5","v":0},{"$f":"'Räkna på nyttorna'!N92/U5","v":{"v":335231.7713733622,"d":"335,232 "}},{"$f":"'Räkna på nyttorna'!O92/V5","v":{"v":976403.2175923171,"d":"976,403 "}},{"$f":"'Räkna på nyttorna'!P92/W5","v":{"v":2843892.8667737395,"d":"2,843,893 "}},{"$f":"'Räkna på nyttorna'!Q92/X5","v":{"v":2761061.0357026597,"d":"2,761,061 "}},{"$f":"SUM(NyttorMin[[#This Row],[År 1]:[År 6]])","v":{"v":6916588.891442079,"d":"6,916,589 "}},null,6,{"$f":"'Räkna på nyttorna'!L93/AB5","v":0},{"$f":"'Räkna på nyttorna'!M93/AC5","v":0},{"$f":"'Räkna på nyttorna'!N93/AD5","v":{"v":625765.9732302761,"d":"625,766 "}},{"$f":"'Räkna på nyttorna'!O93/AE5","v":{"v":1822619.3395056585,"d":"1,822,619 "}},{"$f":"'Räkna på nyttorna'!P93/AF5","v":{"v":5308600.0179776475,"d":"5,308,600 "}},{"$f":"'Räkna på nyttorna'!Q93/AG5","v":{"v":5153980.599978298,"d":"5,153,981 "}},{"$f":"SUM(NyttorMax[[#This Row],[År 1]:[År 6]])","v":{"v":12910965.93069188,"d":"12,910,966 "}}]
[null,7,{"$f":"'Räkna på nyttorna'!C108","v":0},{"$f":"'Räkna på nyttorna'!E107","v":0},{"$f":"'Räkna på nyttorna'!C110","v":0},{"$f":"'Räkna på nyttorna'!L108/F5","v":0},{"$f":"'Räkna på nyttorna'!M108/G5","v":0},{"$f":"'Räkna på nyttorna'!N108/H5","v":0},{"$f":"'Räkna på nyttorna'!O108/I5","v":0},{"$f":"'Räkna på nyttorna'!P108/J5","v":0},{"$f":"'Räkna på nyttorna'!Q108/K5","v":0},{"$f":"SUM(Nyttor[[#This Row],[År 1]:[År 6]])","v":0},{"$f":"NyttorMin[[#This Row],[Summa]]","v":0},{"$f":"NyttorMax[[#This Row],[Summa]]","v":0},0,"",null,7,{"$f":"'Räkna på nyttorna'!L109/S5","v":0},{"$f":"'Räkna på nyttorna'!M109/T5","v":0},{"$f":"'Räkna på nyttorna'!N109/U5","v":0},{"$f":"'Räkna på nyttorna'!O109/V5","v":0},{"$f":"'Räkna på nyttorna'!P109/W5","v":0},{"$f":"'Räkna på nyttorna'!Q109/X5","v":0},{"$f":"SUM(NyttorMin[[#This Row],[År 1]:[År 6]])","v":0},null,7,{"$f":"'Räkna på nyttorna'!L110/AB5","v":0},{"$f":"'Räkna på nyttorna'!M110/AC5","v":0},{"$f":"'Räkna på nyttorna'!N110/AD5","v":0},{"$f":"'Räkna på nyttorna'!O110/AE5","v":0},{"$f":"'Räkna på nyttorna'!P110/AF5","v":0},{"$f":"'Räkna på nyttorna'!Q110/AG5","v":0},{"$f":"SUM(NyttorMax[[#This Row],[År 1]:[År 6]])","v":0}]
[null,8,{"$f":"'Räkna på nyttorna'!C125","v":0},{"$f":"'Räkna på nyttorna'!E124","v":0},{"$f":"'Räkna på nyttorna'!C127","v":0},{"$f":"'Räkna på nyttorna'!L125/F5","v":0},{"$f":"'Räkna på nyttorna'!M125/G5","v":0},{"$f":"'Räkna på nyttorna'!N125/H5","v":0},{"$f":"'Räkna på nyttorna'!O125/I5","v":0},{"$f":"'Räkna på nyttorna'!P125/J5","v":0},{"$f":"'Räkna på nyttorna'!Q125/K5","v":0},{"$f":"SUM(Nyttor[[#This Row],[År 1]:[År 6]])","v":0},{"$f":"NyttorMin[[#This Row],[Summa]]","v":0},{"$f":"NyttorMax[[#This Row],[Summa]]","v":0},0,"",null,8,{"$f":"'Räkna på nyttorna'!L126/S5","v":0},{"$f":"'Räkna på nyttorna'!M126/T5","v":0},{"$f":"'Räkna på nyttorna'!N126/U5","v":0},{"$f":"'Räkna på nyttorna'!O126/V5","v":0},{"$f":"'Räkna på nyttorna'!P126/W5","v":0},{"$f":"'Räkna på nyttorna'!Q126/X5","v":0},{"$f":"SUM(NyttorMin[[#This Row],[År 1]:[År 6]])","v":0},null,8,{"$f":"'Räkna på nyttorna'!L127/AB5","v":0},{"$f":"'Räkna på nyttorna'!M127/AC5","v":0},{"$f":"'Räkna på nyttorna'!N127/AD5","v":0},{"$f":"'Räkna på nyttorna'!O127/AE5","v":0},{"$f":"'Räkna på nyttorna'!P127/AF5","v":0},{"$f":"'Räkna på nyttorna'!Q127/AG5","v":0},{"$f":"SUM(NyttorMax[[#This Row],[År 1]:[År 6]])","v":0}]
[null,9,{"$f":"'Räkna på nyttorna'!C142","v":0},{"$f":"'Räkna på nyttorna'!E141","v":0},{"$f":"'Räkna på nyttorna'!C144","v":0},{"$f":"'Räkna på nyttorna'!L142/F5","v":0},{"$f":"'Räkna på nyttorna'!M142/G5","v":0},{"$f":"'Räkna på nyttorna'!N142/H5","v":0},{"$f":"'Räkna på nyttorna'!O142/I5","v":0},{"$f":"'Räkna på nyttorna'!P142/J5","v":0},{"$f":"'Räkna på nyttorna'!Q142/K5","v":0},{"$f":"SUM(Nyttor[[#This Row],[År 1]:[År 6]])","v":0},{"$f":"NyttorMin[[#This Row],[Summa]]","v":0},{"$f":"NyttorMax[[#This Row],[Summa]]","v":0},0,"",null,9,{"$f":"'Räkna på nyttorna'!L143/S5","v":0},{"$f":"'Räkna på nyttorna'!M143/T5","v":0},{"$f":"'Räkna på nyttorna'!N143/U5","v":0},{"$f":"'Räkna på nyttorna'!O143/V5","v":0},{"$f":"'Räkna på nyttorna'!P143/W5","v":0},{"$f":"'Räkna på nyttorna'!Q143/X5","v":0},{"$f":"SUM(NyttorMin[[#This Row],[År 1]:[År 6]])","v":0},null,9,{"$f":"'Räkna på nyttorna'!L144/AB5","v":0},{"$f":"'Räkna på nyttorna'!M144/AC5","v":0},{"$f":"'Räkna på nyttorna'!N144/AD5","v":0},{"$f":"'Räkna på nyttorna'!O144/AE5","v":0},{"$f":"'Räkna på nyttorna'!P144/AF5","v":0},{"$f":"'Räkna på nyttorna'!Q144/AG5","v":0},{"$f":"SUM(NyttorMax[[#This Row],[År 1]:[År 6]])","v":0}]
[null,10,{"$f":"'Räkna på nyttorna'!C159","v":0},{"$f":"'Räkna på nyttorna'!E158","v":0},{"$f":"'Räkna på nyttorna'!C161","v":0},{"$f":"'Räkna på nyttorna'!L159/F5","v":0},{"$f":"'Räkna på nyttorna'!M159/G5","v":0},{"$f":"'Räkna på nyttorna'!N159/H5","v":0},{"$f":"'Räkna på nyttorna'!O159/I5","v":0},{"$f":"'Räkna på nyttorna'!P159/J5","v":0},{"$f":"'Räkna på nyttorna'!Q159/K5","v":0},{"$f":"SUM(Nyttor[[#This Row],[År 1]:[År 6]])","v":0},{"$f":"NyttorMin[[#This Row],[Summa]]","v":0},{"$f":"NyttorMax[[#This Row],[Summa]]","v":0},0,"",null,10,{"$f":"'Räkna på nyttorna'!L160/S5","v":0},{"$f":"'Räkna på nyttorna'!M160/T5","v":0},{"$f":"'Räkna på nyttorna'!N160/U5","v":0},{"$f":"'Räkna på nyttorna'!O160/V5","v":0},{"$f":"'Räkna på nyttorna'!P160/W5","v":0},{"$f":"'Räkna på nyttorna'!Q160/X5","v":0},{"$f":"SUM(NyttorMin[[#This Row],[År 1]:[År 6]])","v":0},null,10,{"$f":"'Räkna på nyttorna'!L161/AB5","v":0},{"$f":"'Räkna på nyttorna'!M161/AC5","v":0},{"$f":"'Räkna på nyttorna'!N161/AD5","v":0},{"$f":"'Räkna på nyttorna'!O161/AE5","v":0},{"$f":"'Räkna på nyttorna'!P161/AF5","v":0},{"$f":"'Räkna på nyttorna'!Q161/AG5","v":0},{"$f":"SUM(NyttorMax[[#This Row],[År 1]:[År 6]])","v":0}]
[null,11,{"$f":"'Räkna på nyttorna'!C176","v":0},{"$f":"'Räkna på nyttorna'!E175","v":0},{"$f":"'Räkna på nyttorna'!C178","v":0},{"$f":"'Räkna på nyttorna'!L176/F5","v":0},{"$f":"'Räkna på nyttorna'!M176/G5","v":0},{"$f":"'Räkna på nyttorna'!N176/H5","v":0},{"$f":"'Räkna på nyttorna'!O176/I5","v":0},{"$f":"'Räkna på nyttorna'!P176/J5","v":0},{"$f":"'Räkna på nyttorna'!Q176/K5","v":0},{"$f":"SUM(Nyttor[[#This Row],[År 1]:[År 6]])","v":0},{"$f":"NyttorMin[[#This Row],[Summa]]","v":0},{"$f":"NyttorMax[[#This Row],[Summa]]","v":0},0,"",null,11,{"$f":"'Räkna på nyttorna'!L177/S5","v":0},{"$f":"'Räkna på nyttorna'!M177/T5","v":0},{"$f":"'Räkna på nyttorna'!N177/U5","v":0},{"$f":"'Räkna på nyttorna'!O177/V5","v":0},{"$f":"'Räkna på nyttorna'!P177/W5","v":0},{"$f":"'Räkna på nyttorna'!Q177/X5","v":0},{"$f":"SUM(NyttorMin[[#This Row],[År 1]:[År 6]])","v":0},null,11,{"$f":"'Räkna på nyttorna'!L178/AB5","v":0},{"$f":"'Räkna på nyttorna'!M178/AC5","v":0},{"$f":"'Räkna på nyttorna'!N178/AD5","v":0},{"$f":"'Räkna på nyttorna'!O178/AE5","v":0},{"$f":"'Räkna på nyttorna'!P178/AF5","v":0},{"$f":"'Räkna på nyttorna'!Q178/AG5","v":0},{"$f":"SUM(NyttorMax[[#This Row],[År 1]:[År 6]])","v":0}]
[null,12,{"$f":"'Räkna på nyttorna'!C193","v":0},{"$f":"'Räkna på nyttorna'!E192","v":0},{"$f":"'Räkna på nyttorna'!C195","v":0},{"$f":"'Räkna på nyttorna'!L193/F5","v":0},{"$f":"'Räkna på nyttorna'!M193/G5","v":0},{"$f":"'Räkna på nyttorna'!N193/H5","v":0},{"$f":"'Räkna på nyttorna'!O193/I5","v":0},{"$f":"'Räkna på nyttorna'!P193/J5","v":0},{"$f":"'Räkna på nyttorna'!Q193/K5","v":0},{"$f":"SUM(Nyttor[[#This Row],[År 1]:[År 6]])","v":0},{"$f":"NyttorMin[[#This Row],[Summa]]","v":0},{"$f":"NyttorMax[[#This Row],[Summa]]","v":0},0,"",null,12,{"$f":"'Räkna på nyttorna'!L194/S5","v":0},{"$f":"'Räkna på nyttorna'!M194/T5","v":0},{"$f":"'Räkna på nyttorna'!N194/U5","v":0},{"$f":"'Räkna på nyttorna'!O194/V5","v":0},{"$f":"'Räkna på nyttorna'!P194/W5","v":0},{"$f":"'Räkna på nyttorna'!Q194/X5","v":0},{"$f":"SUM(NyttorMin[[#This Row],[År 1]:[År 6]])","v":0},null,12,{"$f":"'Räkna på nyttorna'!L195/AB5","v":0},{"$f":"'Räkna på nyttorna'!M195/AC5","v":0},{"$f":"'Räkna på nyttorna'!N195/AD5","v":0},{"$f":"'Räkna på nyttorna'!O195/AE5","v":0},{"$f":"'Räkna på nyttorna'!P195/AF5","v":0},{"$f":"'Räkna på nyttorna'!Q195/AG5","v":0},{"$f":"SUM(NyttorMax[[#This Row],[År 1]:[År 6]])","v":0}]
[null,13,{"$f":"'Räkna på nyttorna'!C210","v":0},{"$f":"'Räkna på nyttorna'!E209","v":0},{"$f":"'Räkna på nyttorna'!C212","v":0},{"$f":"'Räkna på nyttorna'!L210/F5","v":0},{"$f":"'Räkna på nyttorna'!M210/G5","v":0},{"$f":"'Räkna på nyttorna'!N210/H5","v":0},{"$f":"'Räkna på nyttorna'!O210/I5","v":0},{"$f":"'Räkna på nyttorna'!P210/J5","v":0},{"$f":"'Räkna på nyttorna'!Q210/K5","v":0},{"$f":"SUM(Nyttor[[#This Row],[År 1]:[År 6]])","v":0},{"$f":"NyttorMin[[#This Row],[Summa]]","v":0},{"$f":"NyttorMax[[#This Row],[Summa]]","v":0},0,"",null,13,{"$f":"'Räkna på nyttorna'!L211/S5","v":0},{"$f":"'Räkna på nyttorna'!M211/T5","v":0},{"$f":"'Räkna på nyttorna'!N211/U5","v":0},{"$f":"'Räkna på nyttorna'!O211/V5","v":0},{"$f":"'Räkna på nyttorna'!P211/W5","v":0},{"$f":"'Räkna på nyttorna'!Q211/X5","v":0},{"$f":"SUM(NyttorMin[[#This Row],[År 1]:[År 6]])","v":0},null,13,{"$f":"'Räkna på nyttorna'!L212/AB5","v":0},{"$f":"'Räkna på nyttorna'!M212/AC5","v":0},{"$f":"'Räkna på nyttorna'!N212/AD5","v":0},{"$f":"'Räkna på nyttorna'!O212/AE5","v":0},{"$f":"'Räkna på nyttorna'!P212/AF5","v":0},{"$f":"'Räkna på nyttorna'!Q212/AG5","v":0},{"$f":"SUM(NyttorMax[[#This Row],[År 1]:[År 6]])","v":0}]
[null,14,{"$f":"'Räkna på nyttorna'!C227","v":0},{"$f":"'Räkna på nyttorna'!E226","v":0},{"$f":"'Räkna på nyttorna'!C229","v":0},{"$f":"'Räkna på nyttorna'!L227/F5","v":0},{"$f":"'Räkna på nyttorna'!M227/G5","v":0},{"$f":"'Räkna på nyttorna'!N227/H5","v":0},{"$f":"'Räkna på nyttorna'!O227/I5","v":0},{"$f":"'Räkna på nyttorna'!P227/J5","v":0},{"$f":"'Räkna på nyttorna'!Q227/K5","v":0},{"$f":"SUM(Nyttor[[#This Row],[År 1]:[År 6]])","v":0},{"$f":"NyttorMin[[#This Row],[Summa]]","v":0},{"$f":"NyttorMax[[#This Row],[Summa]]","v":0},0,"",null,14,{"$f":"'Räkna på nyttorna'!L228/S5","v":0},{"$f":"'Räkna på nyttorna'!M228/T5","v":0},{"$f":"'Räkna på nyttorna'!N228/U5","v":0},{"$f":"'Räkna på nyttorna'!O228/V5","v":0},{"$f":"'Räkna på nyttorna'!P228/W5","v":0},{"$f":"'Räkna på nyttorna'!Q228/X5","v":0},{"$f":"SUM(NyttorMin[[#This Row],[År 1]:[År 6]])","v":0},null,14,{"$f":"'Räkna på nyttorna'!L229/AB5","v":0},{"$f":"'Räkna på nyttorna'!M229/AC5","v":0},{"$f":"'Räkna på nyttorna'!N229/AD5","v":0},{"$f":"'Räkna på nyttorna'!O229/AE5","v":0},{"$f":"'Räkna på nyttorna'!P229/AF5","v":0},{"$f":"'Räkna på nyttorna'!Q229/AG5","v":0},{"$f":"SUM(NyttorMax[[#This Row],[År 1]:[År 6]])","v":0}]
[null,15,{"$f":"'Räkna på nyttorna'!C244","v":0},{"$f":"'Räkna på nyttorna'!E243","v":0},{"$f":"'Räkna på nyttorna'!C246","v":0},{"$f":"'Räkna på nyttorna'!L244/F5","v":0},{"$f":"'Räkna på nyttorna'!M244/G5","v":0},{"$f":"'Räkna på nyttorna'!N244/H5","v":0},{"$f":"'Räkna på nyttorna'!O244/I5","v":0},{"$f":"'Räkna på nyttorna'!P244/J5","v":0},{"$f":"'Räkna på nyttorna'!Q244/K5","v":0},{"$f":"SUM(Nyttor[[#This Row],[År 1]:[År 6]])","v":0},{"$f":"NyttorMin[[#This Row],[Summa]]","v":0},{"$f":"NyttorMax[[#This Row],[Summa]]","v":0},0,"",null,15,{"$f":"'Räkna på nyttorna'!L245/S5","v":0},{"$f":"'Räkna på nyttorna'!M245/T5","v":0},{"$f":"'Räkna på nyttorna'!N245/U5","v":0},{"$f":"'Räkna på nyttorna'!O245/V5","v":0},{"$f":"'Räkna på nyttorna'!P245/W5","v":0},{"$f":"'Räkna på nyttorna'!Q245/X5","v":0},{"$f":"SUM(NyttorMin[[#This Row],[År 1]:[År 6]])","v":0},null,15,{"$f":"'Räkna på nyttorna'!L246/AB5","v":0},{"$f":"'Räkna på nyttorna'!M246/AC5","v":0},{"$f":"'Räkna på nyttorna'!N246/AD5","v":0},{"$f":"'Räkna på nyttorna'!O246/AE5","v":0},{"$f":"'Räkna på nyttorna'!P246/AF5","v":0},{"$f":"'Räkna på nyttorna'!Q246/AG5","v":0},{"$f":"SUM(NyttorMax[[#This Row],[År 1]:[År 6]])","v":0}]
[null,16,{"$f":"'Räkna på nyttorna'!C261","v":0},{"$f":"'Räkna på nyttorna'!E260","v":0},{"$f":"'Räkna på nyttorna'!C263","v":0},{"$f":"'Räkna på nyttorna'!L261/F5","v":0},{"$f":"'Räkna på nyttorna'!M261/G5","v":0},{"$f":"'Räkna på nyttorna'!N261/H5","v":0},{"$f":"'Räkna på nyttorna'!O261/I5","v":0},{"$f":"'Räkna på nyttorna'!P261/J5","v":0},{"$f":"'Räkna på nyttorna'!Q261/K5","v":0},{"$f":"SUM(Nyttor[[#This Row],[År 1]:[År 6]])","v":0},{"$f":"NyttorMin[[#This Row],[Summa]]","v":0},{"$f":"NyttorMax[[#This Row],[Summa]]","v":0},0,"",null,16,{"$f":"'Räkna på nyttorna'!L262/S5","v":0},{"$f":"'Räkna på nyttorna'!M262/T5","v":0},{"$f":"'Räkna på nyttorna'!N262/U5","v":0},{"$f":"'Räkna på nyttorna'!O262/V5","v":0},{"$f":"'Räkna på nyttorna'!P262/W5","v":0},{"$f":"'Räkna på nyttorna'!Q262/X5","v":0},{"$f":"SUM(NyttorMin[[#This Row],[År 1]:[År 6]])","v":0},null,16,{"$f":"'Räkna på nyttorna'!L263/AB5","v":0},{"$f":"'Räkna på nyttorna'!M263/AC5","v":0},{"$f":"'Räkna på nyttorna'!N263/AD5","v":0},{"$f":"'Räkna på nyttorna'!O263/AE5","v":0},{"$f":"'Räkna på nyttorna'!P263/AF5","v":0},{"$f":"'Räkna på nyttorna'!Q263/AG5","v":0},{"$f":"SUM(NyttorMax[[#This Row],[År 1]:[År 6]])","v":0}]
[null,17,{"$f":"'Räkna på nyttorna'!C278","v":0},{"$f":"'Räkna på nyttorna'!E277","v":0},{"$f":"'Räkna på nyttorna'!C280","v":0},{"$f":"'Räkna på nyttorna'!L278/F5","v":0},{"$f":"'Räkna på nyttorna'!M278/G5","v":0},{"$f":"'Räkna på nyttorna'!N278/H5","v":0},{"$f":"'Räkna på nyttorna'!O278/I5","v":0},{"$f":"'Räkna på nyttorna'!P278/J5","v":0},{"$f":"'Räkna på nyttorna'!Q278/K5","v":0},{"$f":"SUM(Nyttor[[#This Row],[År 1]:[År 6]])","v":0},{"$f":"NyttorMin[[#This Row],[Summa]]","v":0},{"$f":"NyttorMax[[#This Row],[Summa]]","v":0},0,"",null,17,{"$f":"'Räkna på nyttorna'!L279/S5","v":0},{"$f":"'Räkna på nyttorna'!M279/T5","v":0},{"$f":"'Räkna på nyttorna'!N279/U5","v":0},{"$f":"'Räkna på nyttorna'!O279/V5","v":0},{"$f":"'Räkna på nyttorna'!P279/W5","v":0},{"$f":"'Räkna på nyttorna'!Q279/X5","v":0},{"$f":"SUM(NyttorMin[[#This Row],[År 1]:[År 6]])","v":0},null,17,{"$f":"'Räkna på nyttorna'!L280/AB5","v":0},{"$f":"'Räkna på nyttorna'!M280/AC5","v":0},{"$f":"'Räkna på nyttorna'!N280/AD5","v":0},{"$f":"'Räkna på nyttorna'!O280/AE5","v":0},{"$f":"'Räkna på nyttorna'!P280/AF5","v":0},{"$f":"'Räkna på nyttorna'!Q280/AG5","v":0},{"$f":"SUM(NyttorMax[[#This Row],[År 1]:[År 6]])","v":0}]
[null,18,{"$f":"'Räkna på nyttorna'!C295","v":0},{"$f":"'Räkna på nyttorna'!E294","v":0},{"$f":"'Räkna på nyttorna'!C297","v":0},{"$f":"'Räkna på nyttorna'!L295/F5","v":0},{"$f":"'Räkna på nyttorna'!M295/G5","v":0},{"$f":"'Räkna på nyttorna'!N295/H5","v":0},{"$f":"'Räkna på nyttorna'!O295/I5","v":0},{"$f":"'Räkna på nyttorna'!P295/J5","v":0},{"$f":"'Räkna på nyttorna'!Q295/K5","v":0},{"$f":"SUM(Nyttor[[#This Row],[År 1]:[År 6]])","v":0},{"$f":"NyttorMin[[#This Row],[Summa]]","v":0},{"$f":"NyttorMax[[#This Row],[Summa]]","v":0},0,"",null,18,{"$f":"'Räkna på nyttorna'!L296/S5","v":0},{"$f":"'Räkna på nyttorna'!M296/T5","v":0},{"$f":"'Räkna på nyttorna'!N296/U5","v":0},{"$f":"'Räkna på nyttorna'!O296/V5","v":0},{"$f":"'Räkna på nyttorna'!P296/W5","v":0},{"$f":"'Räkna på nyttorna'!Q296/X5","v":0},{"$f":"SUM(NyttorMin[[#This Row],[År 1]:[År 6]])","v":0},null,18,{"$f":"'Räkna på nyttorna'!L297/AB5","v":0},{"$f":"'Räkna på nyttorna'!M297/AC5","v":0},{"$f":"'Räkna på nyttorna'!N297/AD5","v":0},{"$f":"'Räkna på nyttorna'!O297/AE5","v":0},{"$f":"'Räkna på nyttorna'!P297/AF5","v":0},{"$f":"'Räkna på nyttorna'!Q297/AG5","v":0},{"$f":"SUM(NyttorMax[[#This Row],[År 1]:[År 6]])","v":0}]
[null,19,{"$f":"'Räkna på nyttorna'!C312","v":0},{"$f":"'Räkna på nyttorna'!E311","v":0},{"$f":"'Räkna på nyttorna'!C314","v":0},{"$f":"'Räkna på nyttorna'!L312/F5","v":0},{"$f":"'Räkna på nyttorna'!M312/G5","v":0},{"$f":"'Räkna på nyttorna'!N312/H5","v":0},{"$f":"'Räkna på nyttorna'!O312/I5","v":0},{"$f":"'Räkna på nyttorna'!P312/J5","v":0},{"$f":"'Räkna på nyttorna'!Q312/K5","v":0},{"$f":"SUM(Nyttor[[#This Row],[År 1]:[År 6]])","v":0},{"$f":"NyttorMin[[#This Row],[Summa]]","v":0},{"$f":"NyttorMax[[#This Row],[Summa]]","v":0},0,"",null,19,{"$f":"'Räkna på nyttorna'!L313/S5","v":0},{"$f":"'Räkna på nyttorna'!M313/T5","v":0},{"$f":"'Räkna på nyttorna'!N313/U5","v":0},{"$f":"'Räkna på nyttorna'!O313/V5","v":0},{"$f":"'Räkna på nyttorna'!P313/W5","v":0},{"$f":"'Räkna på nyttorna'!Q313/X5","v":0},{"$f":"SUM(NyttorMin[[#This Row],[År 1]:[År 6]])","v":0},null,19,{"$f":"'Räkna på nyttorna'!L314/AB5","v":0},{"$f":"'Räkna på nyttorna'!M314/AC5","v":0},{"$f":"'Räkna på nyttorna'!N314/AD5","v":0},{"$f":"'Räkna på nyttorna'!O314/AE5","v":0},{"$f":"'Räkna på nyttorna'!P314/AF5","v":0},{"$f":"'Räkna på nyttorna'!Q314/AG5","v":0},{"$f":"SUM(NyttorMax[[#This Row],[År 1]:[År 6]])","v":0}]
[null,20,{"$f":"'Räkna på nyttorna'!C329","v":0},{"$f":"'Räkna på nyttorna'!E328","v":0},{"$f":"'Räkna på nyttorna'!C331","v":0},{"$f":"'Räkna på nyttorna'!L329/F5","v":0},{"$f":"'Räkna på nyttorna'!M329/G5","v":0},{"$f":"'Räkna på nyttorna'!N329/H5","v":0},{"$f":"'Räkna på nyttorna'!O329/I5","v":0},{"$f":"'Räkna på nyttorna'!P329/J5","v":0},{"$f":"'Räkna på nyttorna'!Q329/K5","v":0},{"$f":"SUM(Nyttor[[#This Row],[År 1]:[År 6]])","v":0},{"$f":"NyttorMin[[#This Row],[Summa]]","v":0},{"$f":"NyttorMax[[#This Row],[Summa]]","v":0},0,"",null,20,{"$f":"'Räkna på nyttorna'!L330/S5","v":0},{"$f":"'Räkna på nyttorna'!M330/T5","v":0},{"$f":"'Räkna på nyttorna'!N330/U5","v":0},{"$f":"'Räkna på nyttorna'!O330/V5","v":0},{"$f":"'Räkna på nyttorna'!P330/W5","v":0},{"$f":"'Räkna på nyttorna'!Q330/X5","v":0},{"$f":"SUM(NyttorMin[[#This Row],[År 1]:[År 6]])","v":0},null,20,{"$f":"'Räkna på nyttorna'!L331/AB5","v":0},{"$f":"'Räkna på nyttorna'!M331/AC5","v":0},{"$f":"'Räkna på nyttorna'!N331/AD5","v":0},{"$f":"'Räkna på nyttorna'!O331/AE5","v":0},{"$f":"'Räkna på nyttorna'!P331/AF5","v":0},{"$f":"'Räkna på nyttorna'!Q331/AG5","v":0},{"$f":"SUM(NyttorMax[[#This Row],[År 1]:[År 6]])","v":0}]
[null,21,{"$f":"'Räkna på nyttorna'!C346","v":0},{"$f":"'Räkna på nyttorna'!E346","v":0},{"$f":"'Räkna på nyttorna'!C348","v":0},{"$f":"'Räkna på nyttorna'!L346/F5","v":0},{"$f":"'Räkna på nyttorna'!M346/G5","v":0},{"$f":"'Räkna på nyttorna'!N346/H5","v":0},{"$f":"'Räkna på nyttorna'!O346/I5","v":0},{"$f":"'Räkna på nyttorna'!P346/J5","v":0},{"$f":"'Räkna på nyttorna'!Q346/K5","v":0},{"$f":"SUM(Nyttor[[#This Row],[År 1]:[År 6]])","v":0},{"$f":"NyttorMin[[#This Row],[Summa]]","v":0},{"$f":"NyttorMax[[#This Row],[Summa]]","v":0},0,"",null,21,{"$f":"'Räkna på nyttorna'!L347/S5","v":0},{"$f":"'Räkna på nyttorna'!M347/T5","v":0},{"$f":"'Räkna på nyttorna'!N347/U5","v":0},{"$f":"'Räkna på nyttorna'!O347/V5","v":0},{"$f":"'Räkna på nyttorna'!P347/W5","v":0},{"$f":"'Räkna på nyttorna'!Q347/X5","v":0},{"$f":"SUM(NyttorMin[[#This Row],[År 1]:[År 6]])","v":0},null,21,{"$f":"'Räkna på nyttorna'!L348/AB5","v":0},{"$f":"'Räkna på nyttorna'!M348/AC5","v":0},{"$f":"'Räkna på nyttorna'!N348/AD5","v":0},{"$f":"'Räkna på nyttorna'!O348/AE5","v":0},{"$f":"'Räkna på nyttorna'!P348/AF5","v":0},{"$f":"'Räkna på nyttorna'!Q348/AG5","v":0},{"$f":"SUM(NyttorMax[[#This Row],[År 1]:[År 6]])","v":0}]
[null,"Summa",{"$nulls":3},{"$f":"SUBTOTAL(109,Nyttor[År 1])","v":0},{"$f":"SUBTOTAL(109,Nyttor[År 2])","v":0},{"$f":"SUBTOTAL(109,Nyttor[År 3])","v":{"v":15676551.80806296,"d":"15,676,552 "}},{"$f":"SUBTOTAL(109,Nyttor[År 4])","v":{"v":45659859.63513484,"d":"45,659,860 "}},{"$f":"SUBTOTAL(109,Nyttor[År 5])","v":{"v":73691963.62819408,"d":"73,691,964 "}},{"$f":"SUBTOTAL(109,Nyttor[År 6])","v":{"v":71545595.75552821,"d":"71,545,596 "}},{"$f":"SUM(Nyttor[Summa trolig])","v":{"v":206573970.8269201,"d":"206,573,971 "}},{"$f":"SUM(Nyttor[Summa min])","v":{"v":143510199.1413334,"d":"143,510,199 "}},{"$f":"SUM(Nyttor[Summa max])","v":{"v":277098344.6113878,"d":"277,098,345 "}},{"$f":"SUM(Nyttor[Vägt medel])","v":{"v":208066091.2466963,"d":"208,066,091 "}},null,null,"Summa",{"$f":"SUM(NyttorMin[År 1])","v":0},{"$f":"SUM(NyttorMin[År 2])","v":0},{"$f":"SUM(NyttorMin[År 3])","v":{"v":10890748.059006501,"d":"10,890,748 "}},{"$f":"SUM(NyttorMin[År 4])","v":{"v":31720625.414582044,"d":"31,720,625 "}},{"$f":"SUM(NyttorMin[År 5])","v":{"v":51194970.65900355,"d":"51,194,971 "}},{"$f":"SUM(NyttorMin[År 6])","v":{"v":49703855.008741304,"d":"49,703,855 "}},{"$f":"SUM(NyttorMin[Summa])","v":{"v":143510199.1413334,"d":"143,510,199 "}},null,null,{"$f":"SUM(NyttorMax[År 1])","v":0},{"$f":"SUM(NyttorMax[År 2])","v":0},{"$f":"SUM(NyttorMax[År 3])","v":{"v":21300596.113677062,"d":"21,300,596 "}},{"$f":"SUM(NyttorMax[År 4])","v":{"v":62040571.20488464,"d":"62,040,571 "}},{"$f":"SUM(NyttorMax[År 5])","v":{"v":98310291.92690194,"d":"98,310,292 "}},{"$f":"SUM(NyttorMax[År 6])","v":{"v":95446885.36592421,"d":"95,446,885 "}},{"$f":"SUM(NyttorMax[Summa])","v":{"v":277098344.6113878,"d":"277,098,345 "}}]

{"sheet":"Kostnader","index":3,"n_rows":94,"n_cols":32,"rows_kept":94,"merged":[[3,5,3,11],[3,12,3,13],[3,28,3,29],[30,2,30,3],[54,2,54,3]]}
[null,"Kostnader"]
[null,{"$f":"IF(Försättsblad!B6=0,\"\",Försättsblad!B6)","v":"Första linjens digitala vård - nya kanaler - bild och video"}]
[]
[{"$nulls":20},"Diskontering",{"$f":"(1+Diskonteringsränta)^0","v":{"v":1,"d":"1.000 "}},{"$f":"(1+Diskonteringsränta)^1","v":{"v":1.03,"d":"1.030 "}},{"$f":"(1+Diskonteringsränta)^2","v":{"v":1.0609,"d":"1.061 "}},{"$f":"(1+Diskonteringsränta)^3","v":{"v":1.092727,"d":"1.093 "}},{"$f":"(1+Diskonteringsränta)^4","v":{"v":1.12550881,"d":"1.126 "}},{"$f":"(1+Diskonteringsränta)^5","v":{"v":1.1592740742999998,"d":"1.159 "}}]
[{"$nulls":5},{"$f":"Startår","v":2019},{"$f":"F5+1","v":2020},{"$f":"G5+1","v":2021},{"$f":"H5+1","v":2022},{"$f":"I5+1","v":2023},{"$f":"J5+1","v":2024},{"$nulls":10},{"$f":"Startår","v":2019},{"$f":"V5+1","v":2020},{"$f":"W5+1","v":2021},2022,2023,2024]
[null,"ID","Kostnadskategori","Kostnadens namn","Intressent ","år 1","år 2","år 3","år 4","år 5","år 6","Summa trolig","Summa min","Summa max","Vägt medel","Osäkerhet",null,"ID","Kostnadskategori","Kostnadens namn","Intressent ","år 1","år 2","år 3","år 4","år 5","år 6","Summa","Min","Max","Vägt medel","Osäkerhet"]
[null,1,"2. Löpande verksamhetskostnader","Bild - förvaltning 2021","Staten",0,0,{"v":7000000,"d":"7,000,000 "},0,0,0,{"$f":"SUM(F7:K7)","v":{"v":7000000,"d":"7,000,000 "}},{"$f":"0.8*Kostnader4[[#This Row],[Summa trolig]]","v":{"v":5600000,"d":"5,600,000 "}},{"$f":"1.2*Kostnader4[[#This Row],[Summa trolig]]","v":{"v":8400000,"d":"8,400,000 "}},{"$f":"IF(OR(ISBLANK(N7),ISBLANK(M7),ISBLANK(L7)),\"\",(N7+M7+3*L7)/5)","v":{"v":7000000,"d":"7,000,000 "}},{"$f":"IF(OR(ISBLANK(L7),L7=0),\"\",(N7-M7)/5/L7)","v":{"v":0.08,"d":"8%"}},null,1,{"$f":"Kostnader4[[#This Row],[Kostnadskategori]]","v":"2. Löpande verksamhetskostnader"},{"$f":"Kostnader4[[#This Row],[Kostnadens namn]]","v":"Bild - förvaltning 2021"},{"$f":"Kostnader4[[#This Row],[Intressent ]]","v":"Staten"},{"$f":"Kostnader4[[#This Row],[år 1]]/V$4","v":0},{"$f":"Kostnader4[[#This Row],[år 2]]/W$4","v":0},{"$f":"Kostnader4[[#This Row],[år 3]]/X$4","v":{"v":6598171.363936281,"d":"6,598,171 "}},{"$f":"Kostnader4[[#This Row],[år 4]]/Y$4","v":0},{"$f":"Kostnader4[[#This Row],[år 5]]/Z$4","v":0},{"$f":"Kostnader4[[#This Row],[år 6]]/AA$4","v":0},{"$f":"SUM(V7:AA7)","v":{"v":6598171.363936281,"d":"6,598,171 "}},{"$f":"0.8*Kostnader[[#This Row],[Summa]]","v":{"v":5278537.091149025,"d":"5,278,537 "}},{"$f":"1.2*Kostnader[[#This Row],[Summa]]","v":{"v":7917805.636723537,"d":"7,917,806 "}},{"$f":"IF(OR(ISBLANK(AD7),ISBLANK(AC7),ISBLANK(AB7)),\"\",(AD7+AC7+3*AB7)/5)","v":{"v":6598171.363936281,"d":"6,598,171 "}},{"$f":"IF(OR(ISBLANK(AB7),AB7=0),\"\",(AD7-AC7)/5/AB7)","v":{"v":0.07999999999999999,"d":"8%"}}]
[null,2,"2. Löpande verksamhetskostnader","Bild - förvaltning 2022 - 2024","Regioner",0,0,0,{"v":5500000,"d":"5,500,000 "},{"v":5500000,"d":"5,500,000 "},{"v":5500000,"d":"5,500,000 "},{"v":16500000,"d":"16,500,000 "},{"$f":"0.8*Kostnader4[[#This Row],[Summa trolig]]","v":{"v":13200000,"d":"13,200,000 "}},{"$f":"1.2*Kostnader4[[#This Row],[Summa trolig]]","v":{"v":19800000,"d":"19,800,000 "}},{"v":16500000,"d":"16,500,000 "},{"v":0.08,"d":"8%"},null,2,{"$f":"Kostnader4[[#This Row],[Kostnadskategori]]","v":"2. Löpande verksamhetskostnader"},{"$f":"Kostnader4[[#This Row],[Kostnadens namn]]","v":"Bild - förvaltning 2022 - 2024"},{"$f":"Kostnader4[[#This Row],[Intressent ]]","v":"Regioner"},{"$f":"Kostnader4[[#This Row],[år 1]]/V$4","v":0},{"$f":"Kostnader4[[#This Row],[år 2]]/W$4","v":0},{"$f":"Kostnader4[[#This Row],[år 3]]/X$4","v":0},{"$f":"Kostnader4[[#This Row],[år 4]]/Y$4","v":{"v":5033279.126442377,"d":"5,033,279 "}},{"$f":"Kostnader4[[#This Row],[år 5]]/Z$4","v":{"v":4886678.763536289,"d":"4,886,679 "}},{"$f":"Kostnader4[[#This Row],[år 6]]/AA$4","v":{"v":4744348.314112903,"d":"4,744,348 "}},{"$f":"SUM(V8:AA8)","v":{"v":14664306.204091568,"d":"14,664,306 "}},{"$f":"0.8*Kostnader[[#This Row],[Summa]]","v":{"v":11731444.963273255,"d":"11,731,445 "}},{"$f":"1.2*Kostnader[[#This Row],[Summa]]","v":{"v":17597167.44490988,"d":"17,597,167 "}},{"v":14664306.204091568,"d":"14,664,306 "},{"v":0.07999999999999999,"d":"8%"}]
[null,3,"1. Verksamhetsförändring","Bild - införande 2021, tre regioner","Regioner",null,null,{"v":35000,"d":"35,000 "},{"$nulls":3},{"v":35000,"d":"35,000 "},{"$f":"0.8*Kostnader4[[#This Row],[Summa trolig]]","v":{"v":28000,"d":"28,000 "}},{"$f":"1.2*Kostnader4[[#This Row],[Summa trolig]]","v":{"v":42000,"d":"42,000 "}},{"v":35000,"d":"35,000 "},{"v":0.08,"d":"8%"},null,3,{"$f":"Kostnader4[[#This Row],[Kostnadskategori]]","v":"1. Verksamhetsförändring"},{"$f":"Kostnader4[[#This Row],[Kostnadens namn]]","v":"Bild - införande 2021, tre regioner"},{"$f":"Kostnader4[[#This Row],[Intressent ]]","v":"Regioner"},{"$f":"Kostnader4[[#This Row],[år 1]]/V$4","v":0},{"$f":"Kostnader4[[#This Row],[år 2]]/W$4","v":0},{"$f":"Kostnader4[[#This Row],[år 3]]/X$4","v":{"v":32990.8568196814,"d":"32,991 "}},{"$f":"Kostnader4[[#This Row],[år 4]]/Y$4","v":0},{"$f":"Kostnader4[[#This Row],[år 5]]/Z$4","v":0},{"$f":"Kostnader4[[#This Row],[år 6]]/AA$4","v":0},{"v":32990.8568196814,"d":"32,991 "},{"$f":"0.8*Kostnader[[#This Row],[Summa]]","v":{"v":26392.685455745122,"d":"26,393 "}},{"$f":"1.2*Kostnader[[#This Row],[Summa]]","v":{"v":39589.02818361768,"d":"39,589 "}},{"v":32990.8568196814,"d":"32,991 "},{"v":0.07999999999999997,"d":"8%"}]
[null,4,"4. Projekt","Bild - pilotregionernas resurser i pilot 2019","Regioner",{"v":313000,"d":"313,000 "},{"$nulls":5},{"v":313000,"d":"313,000 "},{"$f":"0.8*Kostnader4[[#This Row],[Summa trolig]]","v":{"v":250400,"d":"250,400 "}},{"$f":"1.2*Kostnader4[[#This Row],[Summa trolig]]","v":{"v":375600,"d":"375,600 "}},{"v":313000,"d":"313,000 "},{"v":0.08,"d":"8%"},null,4,{"$f":"Kostnader4[[#This Row],[Kostnadskategori]]","v":"4. Projekt"},{"$f":"Kostnader4[[#This Row],[Kostnadens namn]]","v":"Bild - pilotregionernas resurser i pilot 2019"},{"$f":"Kostnader4[[#This Row],[Intressent ]]","v":"Regioner"},{"$f":"Kostnader4[[#This Row],[år 1]]/V$4","v":{"v":313000,"d":"313,000 "}},{"$f":"Kostnader4[[#This Row],[år 2]]/W$4","v":0},{"$f":"Kostnader4[[#This Row],[år 3]]/X$4","v":0},{"$f":"Kostnader4[[#This Row],[år 4]]/Y$4","v":0},{"$f":"Kostnader4[[#This Row],[år 5]]/Z$4","v":0},{"$f":"Kostnader4[[#This Row],[år 6]]/AA$4","v":0},{"v":313000,"d":"313,000 "},{"$f":"0.8*Kostnader[[#This Row],[Summa]]","v":{"v":250400,"d":"250,400 "}},{"$f":"1.2*Kostnader[[#This Row],[Summa]]","v":{"v":375600,"d":"375,600 "}},{"v":313000,"d":"313,000 "},{"v":0.08,"d":"8%"}]
[null,5,"4. Projekt","Bild - utbildning 40 sjuksköterskor i pilot 2019","Regioner",{"v":108000,"d":"108,000 "},{"$nulls":5},{"v":108000,"d":"108,000 "},{"$f":"0.8*Kostnader4[[#This Row],[Summa trolig]]","v":{"v":86400,"d":"86,400 "}},{"$f":"1.2*Kostnader4[[#This Row],[Summa trolig]]","v":{"v":129600,"d":"129,600 "}},{"v":108000,"d":"108,000 "},{"v":0.08,"d":"8%"},null,5,{"$f":"Kostnader4[[#This Row],[Kostnadskategori]]","v":"4. Projekt"},{"$f":"Kostnader4[[#This Row],[Kostnadens namn]]","v":"Bild - utbildning 40 sjuksköterskor i pilot 2019"},{"$f":"Kostnader4[[#This Row],[Intressent ]]","v":"Regioner"},{"$f":"Kostnader4[[#This Row],[år 1]]/V$4","v":{"v":108000,"d":"108,000 "}},{"$f":"Kostnader4[[#This Row],[år 2]]/W$4","v":0},{"$f":"Kostnader4[[#This Row],[år 3]]/X$4","v":0},{"$f":"Kostnader4[[#This Row],[år 4]]/Y$4","v":0},{"$f":"Kostnader4[[#This Row],[år 5]]/Z$4","v":0},{"$f":"Kostnader4[[#This Row],[år 6]]/AA$4","v":0},{"v":108000,"d":"108,000 "},{"$f":"0.8*Kostnader[[#This Row],[Summa]]","v":{"v":86400,"d":"86,400 "}},{"$f":"1.2*Kostnader[[#This Row],[Summa]]","v":{"v":129600,"d":"129,600 "}},{"v":108000,"d":"108,000 "},{"v":0.08,"d":"8%"}]
[null,6,"2. Löpande verksamhetskostnader","Bild - utbildning sjuksköterskor breddinförande","Regioner",null,{"$f":"(L80+G87)/2","v":{"v":1459200,"d":"1,459,200 "}},{"$f":"(L80+G87)/2","v":{"v":1459200,"d":"1,459,200 "}},{"$nulls":3},{"v":2918400,"d":"2,918,400 "},{"$f":"0.8*Kostnader4[[#This Row],[Summa trolig]]","v":{"v":2334720,"d":"2,334,720 "}},{"$f":"1.2*Kostnader4[[#This Row],[Summa trolig]]","v":{"v":3502080,"d":"3,502,080 "}},{"v":2918400,"d":"2,918,400 "},{"v":0.08,"d":"8%"},null,6,{"$f":"Kostnader4[[#This Row],[Kostnadskategori]]","v":"2. Löpande verksamhetskostnader"},{"$f":"Kostnader4[[#This Row],[Kostnadens namn]]","v":"Bild - utbildning sjuksköterskor breddinförande"},{"$f":"Kostnader4[[#This Row],[Intressent ]]","v":"Regioner"},{"$f":"Kostnader4[[#This Row],[år 1]]/V$4","v":0},{"$f":"Kostnader4[[#This Row],[år 2]]/W$4","v":{"v":1416699.0291262136,"d":"1,416,699 "}},{"$f":"Kostnader4[[#This Row],[år 3]]/X$4","v":{"v":1375435.9506079743,"d":"1,375,436 "}},{"$f":"Kostnader4[[#This Row],[år 4]]/Y$4","v":0},{"$f":"Kostnader4[[#This Row],[år 5]]/Z$4","v":0},{"$f":"Kostnader4[[#This Row],[år 6]]/AA$4","v":0},{"v":2792134.979734188,"d":"2,792,135 "},{"$f":"0.8*Kostnader[[#This Row],[Summa]]","v":{"v":2233707.9837873504,"d":"2,233,708 "}},{"$f":"1.2*Kostnader[[#This Row],[Summa]]","v":{"v":3350561.9756810255,"d":"3,350,562 "}},{"v":2792134.979734188,"d":"2,792,135 "},{"v":0.08,"d":"8%"}]
[null,7,"2. Löpande verksamhetskostnader","Bild - årlig utbildning sjuksköterskor","Regioner",{"$nulls":3},{"$f":"G93","v":{"v":152000,"d":"152,000 "}},{"$f":"H93","v":0},0,{"v":152000,"d":"152,000 "},{"$f":"0.8*Kostnader4[[#This Row],[Summa trolig]]","v":{"v":121600,"d":"121,600 "}},{"$f":"1.2*Kostnader4[[#This Row],[Summa trolig]]","v":{"v":182400,"d":"182,400 "}},{"v":152000,"d":"152,000 "},{"v":0.08,"d":"8%"},null,7,{"$f":"Kostnader4[[#This Row],[Kostnadskategori]]","v":"2. Löpande verksamhetskostnader"},{"$f":"Kostnader4[[#This Row],[Kostnadens namn]]","v":"Bild - årlig utbildning sjuksköterskor"},{"$f":"Kostnader4[[#This Row],[Intressent ]]","v":"Regioner"},{"$f":"Kostnader4[[#This Row],[år 1]]/V$4","v":0},{"$f":"Kostnader4[[#This Row],[år 2]]/W$4","v":0},{"$f":"Kostnader4[[#This Row],[år 3]]/X$4","v":0},{"$f":"Kostnader4[[#This Row],[år 4]]/Y$4","v":{"v":139101.53222168025,"d":"139,102 "}},{"$f":"Kostnader4[[#This Row],[år 5]]/Z$4","v":0},{"$f":"Kostnader4[[#This Row],[år 6]]/AA$4","v":0},{"v":139101.53222168025,"d":"139,102 "},{"$f":"0.8*Kostnader[[#This Row],[Summa]]","v":{"v":111281.2257773442,"d":"111,281 "}},{"$f":"1.2*Kostnader[[#This Row],[Summa]]","v":{"v":166921.8386660163,"d":"166,922 "}},{"v":139101.53222168022,"d":"139,102 "},{"v":0.08,"d":"8%"}]
[null,8,"4. Projekt","Projekt Inera - etapp 1 - utveckling av verktyg och piloter","Inera",{"v":4895000,"d":"4,895,000 "},{"$nulls":5},{"v":4895000,"d":"4,895,000 "},{"$f":"0.8*Kostnader4[[#This Row],[Summa trolig]]","v":{"v":3916000,"d":"3,916,000 "}},{"$f":"1.2*Kostnader4[[#This Row],[Summa trolig]]","v":{"v":5874000,"d":"5,874,000 "}},{"v":4895000,"d":"4,895,000 "},{"v":0.08,"d":"8%"},null,8,{"$f":"Kostnader4[[#This Row],[Kostnadskategori]]","v":"4. Projekt"},{"$f":"Kostnader4[[#This Row],[Kostnadens namn]]","v":"Projekt Inera - etapp 1 - utveckling av verktyg och piloter"},{"$f":"Kostnader4[[#This Row],[Intressent ]]","v":"Inera"},{"$f":"Kostnader4[[#This Row],[år 1]]/V$4","v":{"v":4895000,"d":"4,895,000 "}},{"$f":"Kostnader4[[#This Row],[år 2]]/W$4","v":0},{"$f":"Kostnader4[[#This Row],[år 3]]/X$4","v":0},{"$f":"Kostnader4[[#This Row],[år 4]]/Y$4","v":0},{"$f":"Kostnader4[[#This Row],[år 5]]/Z$4","v":0},{"$f":"Kostnader4[[#This Row],[år 6]]/AA$4","v":0},{"v":4895000,"d":"4,895,000 "},{"$f":"0.8*Kostnader[[#This Row],[Summa]]","v":{"v":3916000,"d":"3,916,000 "}},{"$f":"1.2*Kostnader[[#This Row],[Summa]]","v":{"v":5874000,"d":"5,874,000 "}},{"v":4895000,"d":"4,895,000 "},{"v":0.08,"d":"8%"}]
[null,9,"4. Projekt","Projekt Inera - etapp 2 - breddinförande av bildverktyget","Staten",null,{"v":7000000,"d":"7,000,000 "},null,0,0,0,{"v":7000000,"d":"7,000,000 "},{"$f":"0.8*Kostnader4[[#This Row],[Summa trolig]]","v":{"v":5600000,"d":"5,600,000 "}},{"$f":"1.2*Kostnader4[[#This Row],[Summa trolig]]","v":{"v":8400000,"d":"8,400,000 "}},{"v":7000000,"d":"7,000,000 "},{"v":0.08,"d":"8%"},null,9,{"$f":"Kostnader4[[#This Row],[Kostnadskategori]]","v":"4. Projekt"},{"$f":"Kostnader4[[#This Row],[Kostnadens namn]]","v":"Projekt Inera - etapp 2 - breddinförande av bildverktyget"},{"$f":"Kostnader4[[#This Row],[Intressent ]]","v":"Staten"},{"$f":"Kostnader4[[#This Row],[år 1]]/V$4","v":0},{"$f":"Kostnader4[[#This Row],[år 2]]/W$4","v":{"v":6796116.504854369,"d":"6,796,117 "}},{"$f":"Kostnader4[[#This Row],[år 3]]/X$4","v":0},{"$f":"Kostnader4[[#This Row],[år 4]]/Y$4","v":0},{"$f":"Kostnader4[[#This Row],[år 5]]/Z$4","v":0},{"$f":"Kostnader4[[#This Row],[år 6]]/AA$4","v":0},{"v":6796116.504854369,"d":"6,796,117 "},{"$f":"0.8*Kostnader[[#This Row],[Summa]]","v":{"v":5436893.203883495,"d":"5,436,893 "}},{"$f":"1.2*Kostnader[[#This Row],[Summa]]","v":{"v":8155339.805825243,"d":"8,155,340 "}},{"v":6796116.504854369,"d":"6,796,117 "},{"v":0.07999999999999999,"d":"8%"}]
[null,10,"1. Verksamhetsförändring","Bild - ökad bemanning pga längre samtalstider","Regioner",null,null,{"$f":"$D$51","v":{"v":5461200,"d":"5,461,200 "}},{"$f":"$D$51","v":{"v":5461200,"d":"5,461,200 "}},{"v":5461200,"d":"5,461,200 "},{"v":5461200,"d":"5,461,200 "},{"v":21844800,"d":"21,844,800 "},{"$f":"0.8*Kostnader4[[#This Row],[Summa trolig]]","v":{"v":17475840,"d":"17,475,840 "}},{"$f":"1.2*Kostnader4[[#This Row],[Summa trolig]]","v":{"v":26213760,"d":"26,213,760 "}},{"v":21844800,"d":"21,844,800 "},{"v":0.08,"d":"8%"},null,10,{"$f":"Kostnader4[[#This Row],[Kostnadskategori]]","v":"1. Verksamhetsförändring"},{"$f":"Kostnader4[[#This Row],[Kostnadens namn]]","v":"Bild - ökad bemanning pga längre samtalstider"},{"$f":"Kostnader4[[#This Row],[Intressent ]]","v":"Regioner"},{"$f":"Kostnader4[[#This Row],[år 1]]/V$4","v":0},{"$f":"Kostnader4[[#This Row],[år 2]]/W$4","v":0},{"$f":"Kostnader4[[#This Row],[år 3]]/X$4","v":{"v":5147704.77896126,"d":"5,147,705 "}},{"$f":"Kostnader4[[#This Row],[år 4]]/Y$4","v":{"v":4997771.630059475,"d":"4,997,772 "}},{"$f":"Kostnader4[[#This Row],[år 5]]/Z$4","v":{"v":4852205.466077161,"d":"4,852,205 "}},{"$f":"Kostnader4[[#This Row],[år 6]]/AA$4","v":{"v":4710879.093278797,"d":"4,710,879 "}},{"v":19708560.968376696,"d":"19,708,561 "},{"$f":"0.8*Kostnader[[#This Row],[Summa]]","v":{"v":15766848.774701357,"d":"15,766,849 "}},{"$f":"1.2*Kostnader[[#This Row],[Summa]]","v":{"v":23650273.162052035,"d":"23,650,273 "}},{"v":19708560.968376696,"d":"19,708,561 "},{"v":0.08,"d":"8%"}]
[null,11,"4. Projekt","Projekt Inera - etapp 2 - förberedelse för video","Staten",0,{"v":2000000,"d":"2,000,000 "},{"v":4000000,"d":"4,000,000 "},0,0,0,{"v":6000000,"d":"6,000,000 "},{"$f":"0.8*Kostnader4[[#This Row],[Summa trolig]]","v":{"v":4800000,"d":"4,800,000 "}},{"$f":"1.2*Kostnader4[[#This Row],[Summa trolig]]","v":{"v":7200000,"d":"7,200,000 "}},{"v":6000000,"d":"6,000,000 "},{"v":0.08,"d":"8%"},null,11,{"$f":"Kostnader4[[#This Row],[Kostnadskategori]]","v":"4. Projekt"},{"$f":"Kostnader4[[#This Row],[Kostnadens namn]]","v":"Projekt Inera - etapp 2 - förberedelse för video"},{"$f":"Kostnader4[[#This Row],[Intressent ]]","v":"Staten"},{"$f":"Kostnader4[[#This Row],[år 1]]/V$4","v":0},{"$f":"Kostnader4[[#This Row],[år 2]]/W$4","v":{"v":1941747.572815534,"d":"1,941,748 "}},{"$f":"Kostnader4[[#This Row],[år 3]]/X$4","v":{"v":3770383.6365350178,"d":"3,770,384 "}},{"$f":"Kostnader4[[#This Row],[år 4]]/Y$4","v":0},{"$f":"Kostnader4[[#This Row],[år 5]]/Z$4","v":0},{"$f":"Kostnader4[[#This Row],[år 6]]/AA$4","v":0},{"v":5712131.2093505515,"d":"5,712,131 "},{"$f":"0.8*Kostnader[[#This Row],[Summa]]","v":{"v":4569704.967480442,"d":"4,569,705 "}},{"$f":"1.2*Kostnader[[#This Row],[Summa]]","v":{"v":6854557.451220661,"d":"6,854,557 "}},{"v":5712131.2093505515,"d":"5,712,131 "},{"v":0.07999999999999997,"d":"8%"}]
[null,12,"2. Löpande verksamhetskostnader","Video - förvaltning 2021","Staten",0,0,{"v":7000000,"d":"7,000,000 "},0,0,0,{"v":7000000,"d":"7,000,000 "},{"$f":"0.8*Kostnader4[[#This Row],[Summa trolig]]","v":{"v":5600000,"d":"5,600,000 "}},{"$f":"1.2*Kostnader4[[#This Row],[Summa trolig]]","v":{"v":8400000,"d":"8,400,000 "}},{"v":7000000,"d":"7,000,000 "},{"v":0.08,"d":"8%"},null,12,{"$f":"Kostnader4[[#This Row],[Kostnadskategori]]","v":"2. Löpande verksamhetskostnader"},{"$f":"Kostnader4[[#This Row],[Kostnadens namn]]","v":"Video - förvaltning 2021"},{"$f":"Kostnader4[[#This Row],[Intressent ]]","v":"Staten"},{"$f":"Kostnader4[[#This Row],[år 1]]/V$4","v":0},{"$f":"Kostnader4[[#This Row],[år 2]]/W$4","v":0},{"$f":"Kostnader4[[#This Row],[år 3]]/X$4","v":{"v":6598171.363936281,"d":"6,598,171 "}},{"$f":"Kostnader4[[#This Row],[år 4]]/Y$4","v":0},{"$f":"Kostnader4[[#This Row],[år 5]]/Z$4","v":0},{"$f":"Kostnader4[[#This Row],[år 6]]/AA$4","v":0},{"v":6598171.363936281,"d":"6,598,171 "},{"$f":"0.8*Kostnader[[#This Row],[Summa]]","v":{"v":5278537.091149025,"d":"5,278,537 "}},{"$f":"1.2*Kostnader[[#This Row],[Summa]]","v":{"v":7917805.636723537,"d":"7,917,806 "}},{"v":6598171.363936281,"d":"6,598,171 "},{"v":0.07999999999999999,"d":"8%"}]
[null,13,"2. Löpande verksamhetskostnader","Video - förvaltning 2022 - 2024","Regioner",0,0,0,{"v":5000000,"d":"5,000,000 "},{"v":5000000,"d":"5,000,000 "},{"v":5000000,"d":"5,000,000 "},{"v":15000000,"d":"15,000,000 "},{"$f":"0.8*Kostnader4[[#This Row],[Summa trolig]]","v":{"v":12000000,"d":"12,000,000 "}},{"$f":"1.2*Kostnader4[[#This Row],[Summa trolig]]","v":{"v":18000000,"d":"18,000,000 "}},{"v":15000000,"d":"15,000,000 "},{"v":0.08,"d":"8%"},null,13,{"$f":"Kostnader4[[#This Row],[Kostnadskategori]]","v":"2. Löpande verksamhetskostnader"},{"$f":"Kostnader4[[#This Row],[Kostnadens namn]]","v":"Video - förvaltning 2022 - 2024"},{"$f":"Kostnader4[[#This Row],[Intressent ]]","v":"Regioner"},{"$f":"Kostnader4[[#This Row],[år 1]]/V$4","v":0},{"$f":"Kostnader4[[#This Row],[år 2]]/W$4","v":0},{"$f":"Kostnader4[[#This Row],[år 3]]/X$4","v":0},{"$f":"Kostnader4[[#This Row],[år 4]]/Y$4","v":{"v":4575708.296765798,"d":"4,575,708 "}},{"$f":"Kostnader4[[#This Row],[år 5]]/Z$4","v":{"v":4442435.2395784445,"d":"4,442,435 "}},{"$f":"Kostnader4[[#This Row],[år 6]]/AA$4","v":{"v":4313043.92192082,"d":"4,313,044 "}},{"v":13331187.458265062,"d":"13,331,187 "},{"$f":"0.8*Kostnader[[#This Row],[Summa]]","v":{"v":10664949.96661205,"d":"10,664,950 "}},{"$f":"1.2*Kostnader[[#This Row],[Summa]]","v":{"v":15997424.949918075,"d":"15,997,425 "}},{"v":13331187.458265062,"d":"13,331,187 "},{"v":0.07999999999999999,"d":"8%"}]
[null,14,"1. Verksamhetsförändring","Video - införande 20 regioner","Regioner",null,null,{"v":350000,"d":"350,000 "},{"v":300000,"d":"300,000 "},null,null,{"v":650000,"d":"650,000 "},{"$f":"0.8*Kostnader4[[#This Row],[Summa trolig]]","v":{"v":520000,"d":"520,000 "}},{"$f":"1.2*Kostnader4[[#This Row],[Summa trolig]]","v":{"v":780000,"d":"780,000 "}},{"v":650000,"d":"650,000 "},{"v":0.08,"d":"8%"},null,14,{"$f":"Kostnader4[[#This Row],[Kostnadskategori]]","v":"1. Verksamhetsförändring"},{"$f":"Kostnader4[[#This Row],[Kostnadens namn]]","v":"Video - införande 20 regioner"},{"$f":"Kostnader4[[#This Row],[Intressent ]]","v":"Regioner"},{"$f":"Kostnader4[[#This Row],[år 1]]/V$4","v":0},{"$f":"Kostnader4[[#This Row],[år 2]]/W$4","v":0},{"$f":"Kostnader4[[#This Row],[år 3]]/X$4","v":{"v":329908.56819681404,"d":"329,909 "}},{"$f":"Kostnader4[[#This Row],[år 4]]/Y$4","v":{"v":274542.49780594785,"d":"274,542 "}},{"$f":"Kostnader4[[#This Row],[år 5]]/Z$4","v":0},{"$f":"Kostnader4[[#This Row],[år 6]]/AA$4","v":0},{"v":604451.066002762,"d":"604,451 "},{"$f":"0.8*Kostnader[[#This Row],[Summa]]","v":{"v":483560.85280220956,"d":"483,561 "}},{"$f":"1.2*Kostnader[[#This Row],[Summa]]","v":{"v":725341.2792033143,"d":"725,341 "}},{"v":604451.066002762,"d":"604,451 "},{"v":0.08,"d":"8%"}]
[null,15,"4. Projekt","Video - pilotregionernas resurser i pilot 2019","Regioner",{"v":313000,"d":"313,000 "},{"$nulls":5},{"v":313000,"d":"313,000 "},{"$f":"0.8*Kostnader4[[#This Row],[Summa trolig]]","v":{"v":250400,"d":"250,400 "}},{"$f":"1.2*Kostnader4[[#This Row],[Summa trolig]]","v":{"v":375600,"d":"375,600 "}},{"v":313000,"d":"313,000 "},{"v":0.08,"d":"8%"},null,15,{"$f":"Kostnader4[[#This Row],[Kostnadskategori]]","v":"4. Projekt"},{"$f":"Kostnader4[[#This Row],[Kostnadens namn]]","v":"Video - pilotregionernas resurser i pilot 2019"},{"$f":"Kostnader4[[#This Row],[Intressent ]]","v":"Regioner"},{"$f":"Kostnader4[[#This Row],[år 1]]/V$4","v":{"v":313000,"d":"313,000 "}},{"$f":"Kostnader4[[#This Row],[år 2]]/W$4","v":0},{"$f":"Kostnader4[[#This Row],[år 3]]/X$4","v":0},{"$f":"Kostnader4[[#This Row],[år 4]]/Y$4","v":0},{"$f":"Kostnader4[[#This Row],[år 5]]/Z$4","v":0},{"$f":"Kostnader4[[#This Row],[år 6]]/AA$4","v":0},{"v":313000,"d":"313,000 "},{"$f":"0.8*Kostnader[[#This Row],[Summa]]","v":{"v":250400,"d":"250,400 "}},{"$f":"1.2*Kostnader[[#This Row],[Summa]]","v":{"v":375600,"d":"375,600 "}},{"v":313000,"d":"313,000 "},{"v":0.08,"d":"8%"}]
[null,16,"4. Projekt","Video - utbildning 40 sjuksköterskor i pilot 2019","Regioner",{"v":108000,"d":"108,000 "},{"$nulls":5},{"v":108000,"d":"108,000 "},{"$f":"0.8*Kostnader4[[#This Row],[Summa trolig]]","v":{"v":86400,"d":"86,400 "}},{"$f":"1.2*Kostnader4[[#This Row],[Summa trolig]]","v":{"v":129600,"d":"129,600 "}},{"v":108000,"d":"108,000 "},{"v":0.08,"d":"8%"},null,16,{"$f":"Kostnader4[[#This Row],[Kostnadskategori]]","v":"4. Projekt"},{"$f":"Kostnader4[[#This Row],[Kostnadens namn]]","v":"Video - utbildning 40 sjuksköterskor i pilot 2019"},{"$f":"Kostnader4[[#This Row],[Intressent ]]","v":"Regioner"},{"$f":"Kostnader4[[#This Row],[år 1]]/V$4","v":{"v":108000,"d":"108,000 "}},{"$f":"Kostnader4[[#This Row],[år 2]]/W$4","v":0},{"$f":"Kostnader4[[#This Row],[år 3]]/X$4","v":0},{"$f":"Kostnader4[[#This Row],[år 4]]/Y$4","v":0},{"$f":"Kostnader4[[#This Row],[år 5]]/Z$4","v":0},{"$f":"Kostnader4[[#This Row],[år 6]]/AA$4","v":0},{"v":108000,"d":"108,000 "},{"$f":"0.8*Kostnader[[#This Row],[Summa]]","v":{"v":86400,"d":"86,400 "}},{"$f":"1.2*Kostnader[[#This Row],[Summa]]","v":{"v":129600,"d":"129,600 "}},{"v":108000,"d":"108,000 "},{"v":0.08,"d":"8%"}]
[null,17,"2. Löpande verksamhetskostnader","Video - utbildning sjuksköterskor breddinförande","Regioner",null,null,{"$f":"(L81+G88)","v":{"v":2723840,"d":"2,723,840 "}},{"$nulls":3},{"v":2723840,"d":"2,723,840 "},{"$f":"0.8*Kostnader4[[#This Row],[Summa trolig]]","v":{"v":2179072,"d":"2,179,072 "}},{"$f":"1.2*Kostnader4[[#This Row],[Summa trolig]]","v":{"v":3268608,"d":"3,268,608 "}},{"v":2723840,"d":"2,723,840 "},{"v":0.08,"d":"8%"},null,17,{"$f":"Kostnader4[[#This Row],[Kostnadskategori]]","v":"2. Löpande verksamhetskostnader"},{"$f":"Kostnader4[[#This Row],[Kostnadens namn]]","v":"Video - utbildning sjuksköterskor breddinförande"},{"$f":"Kostnader4[[#This Row],[Intressent ]]","v":"Regioner"},{"$f":"Kostnader4[[#This Row],[år 1]]/V$4","v":0},{"$f":"Kostnader4[[#This Row],[år 2]]/W$4","v":0},{"$f":"Kostnader4[[#This Row],[år 3]]/X$4","v":{"v":2567480.4411348854,"d":"2,567,480 "}},{"$f":"Kostnader4[[#This Row],[år 4]]/Y$4","v":0},{"$f":"Kostnader4[[#This Row],[år 5]]/Z$4","v":0},{"$f":"Kostnader4[[#This Row],[år 6]]/AA$4","v":0},{"v":2567480.4411348854,"d":"2,567,480 "},{"$f":"0.8*Kostnader[[#This Row],[Summa]]","v":{"v":2053984.3529079084,"d":"2,053,984 "}},{"$f":"1.2*Kostnader[[#This Row],[Summa]]","v":{"v":3080976.529361862,"d":"3,080,977 "}},{"v":2567480.441134886,"d":"2,567,480 "},{"v":0.07999999999999997,"d":"8%"}]
[null,18,"2. Löpande verksamhetskostnader","Video - årlig utbildning sjuksköterskor","Regioner",{"$nulls":3},{"$f":"$G$94","v":{"v":152000,"d":"152,000 "}},{"$f":"$G$94","v":{"v":152000,"d":"152,000 "}},{"v":152000,"d":"152,000 "},{"v":456000,"d":"456,000 "},{"$f":"0.8*Kostnader4[[#This Row],[Summa trolig]]","v":{"v":364800,"d":"364,800 "}},{"$f":"1.2*Kostnader4[[#This Row],[Summa trolig]]","v":{"v":547200,"d":"547,200 "}},{"v":456000,"d":"456,000 "},{"v":0.08,"d":"8%"},null,18,{"$f":"Kostnader4[[#This Row],[Kostnadskategori]]","v":"2. Löpande verksamhetskostnader"},{"$f":"Kostnader4[[#This Row],[Kostnadens namn]]","v":"Video - årlig utbildning sjuksköterskor"},{"$f":"Kostnader4[[#This Row],[Intressent ]]","v":"Regioner"},{"$f":"Kostnader4[[#This Row],[år 1]]/V$4","v":0},{"$f":"Kostnader4[[#This Row],[år 2]]/W$4","v":0},{"$f":"Kostnader4[[#This Row],[år 3]]/X$4","v":0},{"$f":"Kostnader4[[#This Row],[år 4]]/Y$4","v":{"v":139101.53222168025,"d":"139,102 "}},{"$f":"Kostnader4[[#This Row],[år 5]]/Z$4","v":{"v":135050.0312831847,"d":"135,050 "}},{"$f":"Kostnader4[[#This Row],[år 6]]/AA$4","v":{"v":131116.53522639294,"d":"131,117 "}},{"v":405268.09873125784,"d":"405,268 "},{"$f":"0.8*Kostnader[[#This Row],[Summa]]","v":{"v":324214.4789850063,"d":"324,214 "}},{"$f":"1.2*Kostnader[[#This Row],[Summa]]","v":{"v":486321.7184775094,"d":"486,322 "}},{"v":405268.09873125784,"d":"405,268 "},{"v":0.07999999999999999,"d":"8%"}]
[null,19,"2. Löpande verksamhetskostnader","Video - ökad bemanning pga längre samtalstider","Regioner",null,null,{"$f":"$D$74/2","v":{"v":2730600,"d":"2,730,600 "}},{"$f":"$D$74","v":{"v":5461200,"d":"5,461,200 "}},{"v":5461200,"d":"5,461,200 "},{"v":5461200,"d":"5,461,200 "},{"$f":"SUM(F25:K25)","v":{"v":19114200,"d":"19,114,200 "}},{"$f":"0.8*Kostnader4[[#This Row],[Summa trolig]]","v":{"v":15291360,"d":"15,291,360 "}},{"$f":"1.2*Kostnader4[[#This Row],[Summa trolig]]","v":{"v":22937040,"d":"22,937,040 "}},{"$f":"IF(OR(ISBLANK(N25),ISBLANK(M25),ISBLANK(L25)),\"\",(N25+M25+3*L25)/5)","v":{"v":19114200,"d":"19,114,200 "}},{"$f":"IF(OR(ISBLANK(L25),L25=0),\"\",(N25-M25)/5/L25)","v":{"v":0.08,"d":"8%"}},null,19,{"$f":"Kostnader4[[#This Row],[Kostnadskategori]]","v":"2. Löpande verksamhetskostnader"},{"$f":"Kostnader4[[#This Row],[Kostnadens namn]]","v":"Video - ökad bemanning pga längre samtalstider"},{"$f":"Kostnader4[[#This Row],[Intressent ]]","v":"Regioner"},{"$f":"Kostnader4[[#This Row],[år 1]]/V$4","v":0},{"$f":"Kostnader4[[#This Row],[år 2]]/W$4","v":0},{"$f":"Kostnader4[[#This Row],[år 3]]/X$4","v":{"v":2573852.38948063,"d":"2,573,852 "}},{"$f":"Kostnader4[[#This Row],[år 4]]/Y$4","v":{"v":4997771.630059475,"d":"4,997,772 "}},{"$f":"Kostnader4[[#This Row],[år 5]]/Z$4","v":{"v":4852205.466077161,"d":"4,852,205 "}},{"$f":"Kostnader4[[#This Row],[år 6]]/AA$4","v":{"v":4710879.093278797,"d":"4,710,879 "}},{"v":17134708.57889606,"d":"17,134,709 "},{"$f":"0.8*Kostnader[[#This Row],[Summa]]","v":{"v":13707766.86311685,"d":"13,707,767 "}},{"$f":"1.2*Kostnader[[#This Row],[Summa]]","v":{"v":20561650.294675272,"d":"20,561,650 "}},{"v":17134708.57889606,"d":"17,134,709 "},{"v":0.07999999999999999,"d":"8%"}]
[null,20,{"$nulls":9},{"$f":"SUM(F25:K25)","v":{"v":19114200,"d":"19,114,200 "}},{"$f":"0.8*Kostnader4[[#This Row],[Summa trolig]]","v":{"v":15291360,"d":"15,291,360 "}},{"$f":"1.2*Kostnader4[[#This Row],[Summa trolig]]","v":{"v":22937040,"d":"22,937,040 "}},{"v":19114200,"d":"19,114,200 "},{"v":0.08,"d":"8%"},null,20,{"$f":"Kostnader4[[#This Row],[Kostnadskategori]]","v":0},{"$f":"Kostnader4[[#This Row],[Kostnadens namn]]","v":0},{"$f":"Kostnader4[[#This Row],[Intressent ]]","v":0},{"$f":"Kostnader4[[#This Row],[år 1]]/V$4","v":0},{"$f":"Kostnader4[[#This Row],[år 2]]/W$4","v":0},{"$f":"Kostnader4[[#This Row],[år 3]]/X$4","v":0},{"$f":"Kostnader4[[#This Row],[år 4]]/Y$4","v":0},{"$f":"Kostnader4[[#This Row],[år 5]]/Z$4","v":0},{"$f":"Kostnader4[[#This Row],[år 6]]/AA$4","v":0},0,{"$f":"0.8*Kostnader[[#This Row],[Summa]]","v":0},{"$f":"1.2*Kostnader[[#This Row],[Summa]]","v":0},0,""]
[null,21,{"$nulls":9},0,{"$f":"0.8*Kostnader4[[#This Row],[Summa trolig]]","v":0},{"$f":"1.2*Kostnader4[[#This Row],[Summa trolig]]","v":0},0,"",null,21,{"$f":"Kostnader4[[#This Row],[Kostnadskategori]]","v":0},{"$f":"Kostnader4[[#This Row],[Kostnadens namn]]","v":0},{"$f":"Kostnader4[[#This Row],[Intressent ]]","v":0},{"$f":"Kostnader4[[#This Row],[år 1]]/V$4","v":0},{"$f":"Kostnader4[[#This Row],[år 2]]/W$4","v":0},{"$f":"Kostnader4[[#This Row],[år 3]]/X$4","v":0},{"$f":"Kostnader4[[#This Row],[år 4]]/Y$4","v":0},{"$f":"Kostnader4[[#This Row],[år 5]]/Z$4","v":0},{"$f":"Kostnader4[[#This Row],[år 6]]/AA$4","v":0},0,{"$f":"0.8*Kostnader[[#This Row],[Summa]]","v":0},{"$f":"1.2*Kostnader[[#This Row],[Summa]]","v":0},0,""]
[null,"Summa",{"$nulls":3},{"$f":"SUBTOTAL(109,Kostnader4[år 1])","v":{"v":5737000,"d":"5,737,000 "}},{"$f":"SUBTOTAL(109,Kostnader4[år 2])","v":{"v":10459200,"d":"10,459,200 "}},{"$f":"SUBTOTAL(109,Kostnader4[år 3])","v":{"v":30759840,"d":"30,759,840 "}},{"$f":"SUBTOTAL(109,Kostnader4[år 4])","v":{"v":22026400,"d":"22,026,400 "}},{"$f":"SUBTOTAL(109,Kostnader4[år 5])","v":{"v":21574400,"d":"21,574,400 "}},{"$f":"SUBTOTAL(109,Kostnader4[år 6])","v":{"v":21574400,"d":"21,574,400 "}},{"$f":"SUM(Kostnader4[Summa trolig])","v":{"v":131245440,"d":"131,245,440 "}},{"$f":"SUM(Kostnader4[Summa min])","v":{"v":104996352,"d":"104,996,352 "}},{"$f":"SUM(Kostnader4[Summa max])","v":{"v":157494528,"d":"157,494,528 "}},{"$f":"SUM(Kostnader4[Vägt medel])","v":{"v":131245440,"d":"131,245,440 "}},null,null,"Summa",{"$nulls":3},{"$f":"SUM(Kostnader[år 1])","v":{"v":5737000,"d":"5,737,000 "}},{"$f":"SUM(Kostnader[år 2])","v":{"v":10154563.106796117,"d":"10,154,563 "}},{"$f":"SUM(Kostnader[år 3])","v":{"v":28994099.349608824,"d":"28,994,099 "}},{"$f":"SUM(Kostnader[år 4])","v":{"v":20157276.245576434,"d":"20,157,276 "}},{"$f":"SUM(Kostnader[år 5])","v":{"v":19168574.96655224,"d":"19,168,575 "}},{"$f":"SUM(Kostnader[år 6])","v":{"v":18610266.95781771,"d":"18,610,267 "}},{"$f":"SUM(Kostnader[Summa])","v":{"v":102821780.62635133,"d":"102,821,781 "}},{"$f":"SUM(Kostnader[Min])","v":{"v":82257424.50108106,"d":"82,257,425 "}},{"$f":"SUM(Kostnader[Max])","v":{"v":123386136.75162157,"d":"123,386,137 "}},{"$f":"SUM(Kostnader[Vägt medel])","v":{"v":102821780.62635133,"d":"102,821,781 "}}]
[]
[null,null,"Beräkning av ökat personalbehov - bild"]
[]
[]
[null,null,"Ärendetider "]
[{"$nulls":3},"Antal samtal","Medelärendetid"]
[null,null,"Invånarsamtal utan bild (hämtas från \"räkna på nyttorna\")",{"$f":"'Räkna på nyttorna'!F6-D36","v":{"v":2537394.33,"d":"2,537,394 "}},{"v":8,"d":"8.0 "}]
[null,null,"Invånarsamtal med bild (hämtas från \"räkna på nyttorna\")",{"$f":"'Räkna på nyttorna'!F8","v":{"v":190986.67,"d":"190,987 "}},{"v":19,"d":"19.0 "}]
[null,null,"Medelärendetid för alla samtal när bild används i verksamheten",null,{"$f":"((E35*D35)+(E36*D36))/(D35+D36)","v":{"v":8.77,"d":"8.8 "}}]
[]
[{"$nulls":3},"Antaganden i Erlang C"]
[{"$nulls":3},"Samtal per timme för de 16 regioner som planerar att införa video",480]
[{"$nulls":3},"75 % ska besvaras inom 15 minuter (900 sek)"]
[{"$nulls":3},"Medelärendetid med bild",{"$f":"E37","v":{"v":8.77,"d":"8.8 "}}]
[{"$nulls":3},"Medelärendetid utan bild",{"$f":"E35","v":{"v":8,"d":"8.0 "}}]
[]
[{"$nulls":3},"Medelärendetid i sek"]
[null,null,"Antal sjuksköterskor som behövs per timme",{"$f":"E37*60","v":{"v":526.1999999999999,"d":"526 "}},118]
[null,null,"Antal sjuksköterskor som behövs per timme ",{"$f":"8*60","v":480},109]
[null,null,"Antal extra sjuksköterskor som behövs per timme",null,{"$f":"E46-E47","v":9}]
[]
[null,null,"Årskostnad för sjuksköterska",{"v":606800,"d":"606,800 "}]
[null,null,"Årskostnad för alla extra sjuksköterskor som behövs",{"$f":"D50*E48","v":{"v":5461200,"d":"5,461,200 "}}]
[]
[]
[null,null,"Beräkning av ökat personalbehov - video"]
[]
[]
[null,null,"Ärendetider"]
[{"$nulls":3},"Antal samtal","Medelärendetid"]
[null,null,"Invånarsamtal utan video (hämtas från \"räkna på nyttorna\")",{"$f":"'Räkna på nyttorna'!F57-D60","v":{"v":2261552.61,"d":"2,261,553 "}},{"v":8,"d":"8.0 "}]
[null,null,"Invånarsamtal med video (hämtas från \"räkna på nyttorna\")",{"$f":"'Räkna på nyttorna'!F59","v":{"v":170224.39,"d":"170,224 "}},{"v":18,"d":"18.0 "}]
[null,null,"Medelärendetid för alla samtal när video används i verksamheten",null,{"$f":"((E59*D59)+(E60*D60))/(D59+D60)","v":{"v":8.7,"d":"8.7 "}}]
[]
[{"$nulls":3},"Antaganden i Erlang C"]
[{"$nulls":3},"Samtal per timme för de 16 regioner som planerar att införa video",431]
[{"$nulls":3},"75 % ska besvaras inom 15 minuter (900 sek)"]
[{"$nulls":3},"Medelärendetid när vissa samtal sker med video",{"$f":"E61","v":{"v":8.7,"d":"8.7 "}}]
[{"$nulls":3},"Medelärendetid utan video",{"$f":"E59","v":{"v":8,"d":"8.0 "}}]
[]
[null,null,"Antal sjuksköterskor som behövs per timme",{"$f":"E61*60","v":{"v":522,"d":"522.0 "}},106]
[null,null,"Antal sjuksköterskor som behövs per ",480,97]
[null,null,"Antal extra sjuksköterskor som behövs per timme",null,{"$f":"E69-E70","v":9}]
[]
[null,null,"Årskostnad för sjuksköterska",{"v":606800,"d":"606,800 "}]
[null,null,"Årskostnad för alla extra sjuksköterskor som behövs",{"$f":"D73*E71","v":{"v":5461200,"d":"5,461,200 "}}]
[]
[]
[null,null,"Beräkningen för utbildning: "]
[null,null,"Först utbildas  2 sjuksköterskor per region i 2 heldagar. För VGR är det istället 10."]
[{"$nulls":3},"Regioner","Ssk per region","Summa ssk","Plus 10 ssk från VGR","Total summa ssk","Antal timmar","Totalt antal timmar","Pris per timme","Kostnad"]
[null,null,"Bild",18,2,{"$f":"E80*D80","v":36},10,{"$f":"G80+F80","v":46},16,{"$f":"I80*H80","v":736},380,{"$f":"K80*J80","v":{"v":279680,"d":"279,680 "}}]
[null,null,"Video",15,2,{"$f":"E81*D81","v":30},10,{"$f":"G81+F81","v":40},16,{"$f":"I81*H81","v":640},380,{"$f":"K81*J81","v":{"v":243200,"d":"243,200 "}}]
[]
[]
[]
[null,null,"Sedan utbildar de övriga sjuksköterskor i 1 heldag. Vi antar att alla utbildas. Vi räknar bara med de regioner som planerar att införa tjänsten:"]
[{"$nulls":3},"Antal som ska utbildas (baseras på unika användare i RGS för regionerna)","Antal timmar","Timpris","Kostnad"]
[null,null,"Bild - 19 regioner",868,8,380,{"$f":"D87*E87*F87","v":{"v":2638720,"d":"2,638,720 "}}]
[null,null,"Video - 16 regioner",816,8,380,{"$f":"D88*E88*F88","v":{"v":2480640,"d":"2,480,640 "}}]
[]
[]
[null,null,"Och sedan utbildas 50 nya per år (antagande om personalomsättning)"]
[{"$nulls":3},"Antal som ska utbildas","Antal timmar","Timpris","Kostnad"]
[null,null,"Bild",50,8,380,{"$f":"D93*E93*F93","v":{"v":152000,"d":"152,000 "}}]
[null,null,"Video",50,8,380,{"$f":"D94*E94*F94","v":{"v":152000,"d":"152,000 "}}]

{"sheet":"Nyttokalkyl","index":4,"n_rows":123,"n_cols":15,"rows_kept":123,"merged":[[8,2,8,3],[20,2,22,3],[59,2,59,3],[110,2,110,3]]}
[null,null,"Nyttokalkyl"]
[null,null,{"$f":"IF(Försättsblad!B6=0,\"\",Försättsblad!B6)","v":"Första linjens digitala vård - nya kanaler - bild och video"}]
[null,null,"Tabellerna och diagrammen är formaterade för att passa i powerpoint-presentationer. "]
[null,null,"Markera och kopiera tabellen eller diagrammet och välj att \"klistra in som bild\" för ett snyggt resultat."]
[]
[null,null,"Total nytta"]
[]
[]
[null,null,"Nyttorealiseringskalkyl - total nytta",{"$nulls":4},"Nyttorealiseringskalkyl - total nytta"]
[null,null,"För perioden",{"$f":"Startår & \" - \" & Startår+5","v":"2019 - 2024"}]
[{"$nulls":8},{"$f":"Startår","v":2019},{"$f":"I11+1","v":2020},{"$f":"J11+1","v":2021},2022,{"$f":"L11+1","v":2023},{"$f":"M11+1","v":2024},"Totalt"]
[null,null,"Total kostnad",{"$f":"TotalKostnad","v":{"v":-102821780.62635133,"d":"-102,821,781 kr"}},{"$nulls":3},"Total nytta",{"$f":"I13+I14","v":0},{"$f":"J13+J14","v":0},{"v":15676551.80806296,"d":"15,676,552 "},{"v":45659859.63513484,"d":"45,659,860 "},{"v":73691963.62819406,"d":"73,691,964 "},{"v":71545595.75552823,"d":"71,545,596 "},{"v":206573970.8269201,"d":"206,573,971 "}]
[null,null,"Finansiell nytta",{"$f":"O13","v":{"v":18674110.755759776,"d":"18,674,111 kr"}},{"$nulls":3},"Finansiella nyttor",{"$f":"IFERROR(GETPIVOTDATA(\"Summa av år 1\",'-Admin-'!$C$25,\"Nyttokategori\",\"1. Finansiell\"),0)","v":0},{"$f":"IFERROR(GETPIVOTDATA(\"Summa av år 2\",'-Admin-'!$C$25,\"Nyttokategori\",\"1. Finansiell\"),0)","v":0},{"$f":"IFERROR(GETPIVOTDATA(\"Summa av år 3\",'-Admin-'!$C$25,\"Nyttokategori\",\"1. Finansiell\"),0)","v":{"v":1417146.911395984,"d":"1,417,147 "}},{"$f":"IFERROR(GETPIVOTDATA(\"Summa av år 4\",'-Admin-'!$C$25,\"Nyttokategori\",\"1. Finansiell\"),0)","v":{"v":4127612.3632892733,"d":"4,127,612 "}},{"$f":"IFERROR(GETPIVOTDATA(\"Summa av år 5\",'-Admin-'!$C$25,\"Nyttokategori\",\"1. Finansiell\"),0)","v":{"v":6661690.652958992,"d":"6,661,691 "}},{"$f":"IFERROR(GETPIVOTDATA(\"Summa av år 6\",'-Admin-'!$C$25,\"Nyttokategori\",\"1. Finansiell\"),0)","v":{"v":6467660.828115527,"d":"6,467,661 "}},{"$f":"SUM(I13:N13)","v":{"v":18674110.755759776,"d":"18,674,111 "}}]
[null,null,"Omfördelningsnytta",{"$f":"O14","v":{"v":187899860.07116032,"d":"187,899,860 kr"}},{"$nulls":3},"Omfördelningsnyttor",{"$f":"IFERROR(GETPIVOTDATA(\"Summa av år 1\",'-Admin-'!$C$25,\"Nyttokategori\",\"2. Omfördelningsnytta\"),0)","v":0},{"$f":"IFERROR(GETPIVOTDATA(\"Summa av år 2\",'-Admin-'!$C$25,\"Nyttokategori\",\"2. Omfördelningsnytta\"),0)","v":0},{"$f":"IFERROR(GETPIVOTDATA(\"Summa av år 3\",'-Admin-'!$C$25,\"Nyttokategori\",\"2. Omfördelningsnytta\"),0)","v":{"v":14259404.896666976,"d":"14,259,405 "}},{"$f":"IFERROR(GETPIVOTDATA(\"Summa av år 4\",'-Admin-'!$C$25,\"Nyttokategori\",\"2. Omfördelningsnytta\"),0)","v":{"v":41532247.271845564,"d":"41,532,247 "}},{"$f":"IFERROR(GETPIVOTDATA(\"Summa av år 5\",'-Admin-'!$C$25,\"Nyttokategori\",\"2. Omfördelningsnytta\"),0)","v":{"v":67030272.97523507,"d":"67,030,273 "}},{"$f":"IFERROR(GETPIVOTDATA(\"Summa av år 6\",'-Admin-'!$C$25,\"Nyttokategori\",\"2. Omfördelningsnytta\"),0)","v":{"v":65077934.9274127,"d":"65,077,935 "}},{"$f":"SUM(I14:N14)","v":{"v":187899860.07116032,"d":"187,899,860 "}}]
[null,null,"Total nytta",{"$f":"TotalNytta","v":{"v":206573970.8269201,"d":"206,573,971 kr"}}]
[null,null,"Total nettonytta",{"$f":"NettoNytta","v":{"v":103752190.20056877,"d":"103,752,190 kr"}},{"$nulls":3},"Total kostnad",{"$f":"SUM(I17:I20)","v":{"v":-5737000,"d":"-5,737,000 "}},{"$f":"SUM(J17:J20)","v":{"v":-10154563.106796117,"d":"-10,154,563 "}},{"v":-28994099.349608824,"d":"-28,994,099 "},{"v":-20157276.245576434,"d":"-20,157,276 "},{"v":-19168574.96655224,"d":"-19,168,575 "},{"v":-18610266.95781771,"d":"-18,610,267 "},{"v":-102821780.62635133,"d":"-102,821,781 "}]
[{"$nulls":7},"Verksamhets-förändring",{"$f":"IFERROR(-GETPIVOTDATA(\"Summa av År 1\",'-Admin-'!$C$32,\"Kostnadskategori\",\"1. Verksamhetsförändring\"),0)","v":0},{"$f":"IFERROR(-GETPIVOTDATA(\"Summa av År 2\",'-Admin-'!$C$32,\"Kostnadskategori\",\"1. Verksamhetsförändring\"),0)","v":0},{"$f":"IFERROR(-GETPIVOTDATA(\"Summa av År 3\",'-Admin-'!$C$32,\"Kostnadskategori\",\"1. Verksamhetsförändring\"),0)","v":{"v":-5510604.203977756,"d":"-5,510,604 "}},{"$f":"IFERROR(-GETPIVOTDATA(\"Summa av År 4\",'-Admin-'!$C$32,\"Kostnadskategori\",\"1. Verksamhetsförändring\"),0)","v":{"v":-5272314.1278654225,"d":"-5,272,314 "}},{"$f":"IFERROR(-GETPIVOTDATA(\"Summa av År 5\",'-Admin-'!$C$32,\"Kostnadskategori\",\"1. Verksamhetsförändring\"),0)","v":{"v":-4852205.466077161,"d":"-4,852,205 "}},{"$f":"IFERROR(-GETPIVOTDATA(\"Summa av År 6\",'-Admin-'!$C$32,\"Kostnadskategori\",\"1. Verksamhetsförändring\"),0)","v":{"v":-4710879.093278797,"d":"-4,710,879 "}},{"$f":"SUM(I17:N17)","v":{"v":-20346002.891199134,"d":"-20,346,003 "}}]
[null,null,"Return on investment (ROI)",{"$f":"IF(-TotalKostnad=0,0,TotalNettoNytta/-TotalKostnad)","v":{"v":1.0090487595969428,"d":"1.01 kr"}},{"$nulls":3},"Löpande verksamhets-kostnader",{"$f":"IFERROR(-GETPIVOTDATA(\"Summa av År 1\",'-Admin-'!$C$32,\"Kostnadskategori\",\"2. Löpande verksamhetskostnader\"),0)","v":0},{"$f":"IFERROR(-GETPIVOTDATA(\"Summa av År 2\",'-Admin-'!$C$32,\"Kostnadskategori\",\"2. Löpande verksamhetskostnader\"),0)","v":{"v":-1416699.0291262136,"d":"-1,416,699 "}},{"$f":"IFERROR(-GETPIVOTDATA(\"Summa av År 3\",'-Admin-'!$C$32,\"Kostnadskategori\",\"2. Löpande verksamhetskostnader\"),0)","v":{"v":-19713111.50909605,"d":"-19,713,112 "}},{"$f":"IFERROR(-GETPIVOTDATA(\"Summa av År 4\",'-Admin-'!$C$32,\"Kostnadskategori\",\"2. Löpande verksamhetskostnader\"),0)","v":{"v":-14884962.117711011,"d":"-14,884,962 "}},{"$f":"IFERROR(-GETPIVOTDATA(\"Summa av År 5\",'-Admin-'!$C$32,\"Kostnadskategori\",\"2. Löpande verksamhetskostnader\"),0)","v":{"v":-14316369.500475079,"d":"-14,316,370 "}},{"$f":"IFERROR(-GETPIVOTDATA(\"Summa av År 6\",'-Admin-'!$C$32,\"Kostnadskategori\",\"2. Löpande verksamhetskostnader\"),0)","v":{"v":-13899387.864538914,"d":"-13,899,388 "}},{"$f":"SUM(I18:N18)","v":{"v":-64230530.02094727,"d":"-64,230,530 "}}]
[null,null,"Payback-år",{"$f":"IF('-Admin-'!D103=0,\"Ingen payback\",'-Admin-'!D103)","v":2023},{"$nulls":3},"Investeringar",{"$f":"IFERROR(-GETPIVOTDATA(\"Summa av År 1\",'-Admin-'!$C$32,\"Kostnadskategori\",\"3. Investeringar\"),0)","v":0},{"$f":"IFERROR(-GETPIVOTDATA(\"Summa av År 2\",'-Admin-'!$C$32,\"Kostnadskategori\",\"3. Investeringar\"),0)","v":0},{"$f":"IFERROR(-GETPIVOTDATA(\"Summa av År 3\",'-Admin-'!$C$32,\"Kostnadskategori\",\"3. Investeringar\"),0)","v":0},{"$f":"IFERROR(-GETPIVOTDATA(\"Summa av År 4\",'-Admin-'!$C$32,\"Kostnadskategori\",\"3. Investeringar\"),0)","v":0},{"$f":"IFERROR(-GETPIVOTDATA(\"Summa av År 5\",'-Admin-'!$C$32,\"Kostnadskategori\",\"3. Investeringar\"),0)","v":0},{"$f":"IFERROR(-GETPIVOTDATA(\"Summa av År 6\",'-Admin-'!$C$32,\"Kostnadskategori\",\"3. Investeringar\"),0)","v":0},{"$f":"SUM(I19:N19)","v":0}]
[{"$nulls":7},"Projekt",{"$f":"IFERROR(-GETPIVOTDATA(\"Summa av År 1\",'-Admin-'!$C$32,\"Kostnadskategori\",\"4. Projekt\"),0)","v":{"v":-5737000,"d":"-5,737,000 "}},{"$f":"IFERROR(-GETPIVOTDATA(\"Summa av År 2\",'-Admin-'!$C$32,\"Kostnadskategori\",\"4. Projekt\"),0)","v":{"v":-8737864.077669904,"d":"-8,737,864 "}},{"$f":"IFERROR(-GETPIVOTDATA(\"Summa av År 3\",'-Admin-'!$C$32,\"Kostnadskategori\",\"4. Projekt\"),0)","v":{"v":-3770383.6365350178,"d":"-3,770,384 "}},{"$f":"IFERROR(-GETPIVOTDATA(\"Summa av År 4\",'-Admin-'!$C$32,\"Kostnadskategori\",\"4. Projekt\"),0)","v":0},{"$f":"IFERROR(-GETPIVOTDATA(\"Summa av År 5\",'-Admin-'!$C$32,\"Kostnadskategori\",\"4. Projekt\"),0)","v":0},{"$f":"IFERROR(-GETPIVOTDATA(\"Summa av År 6\",'-Admin-'!$C$32,\"Kostnadskategori\",\"4. Projekt\"),0)","v":0},{"v":-18245247.714204922,"d":"-18,245,248 "}]
[null,null,"Return on investment (ROI) är intjänad värderad nytta per investerad krona. \nPayback-år är året då de värderade nyttorna förväntas överstiga kostnaderna. "]
[{"$nulls":7},"Finansiell nettonytta",{"$f":"I13+I16","v":{"v":-5737000,"d":"-5,737,000 "}},{"$f":"J13+J16","v":{"v":-10154563.106796117,"d":"-10,154,563 "}},{"v":-27576952.438212838,"d":"-27,576,952 "},{"v":-16029663.88228716,"d":"-16,029,664 "},{"v":-12506884.313593246,"d":"-12,506,884 "},{"v":-12142606.129702184,"d":"-12,142,606 "},{"$f":"O13+O16","v":{"v":-84147669.87059155,"d":"-84,147,670 "}}]
[{"$nulls":7},"Ackumulerad finansiell nettonytta",{"$f":"I14+I16","v":{"v":-5737000,"d":"-5,737,000 "}},{"$f":"IF(J22=0,I23,I23+J22)","v":{"v":-15891563.106796117,"d":"-15,891,563 "}},{"$f":"IF(K22=0,J23,J23+K22)","v":{"v":-43468515.54500896,"d":"-43,468,516 "}},{"$f":"IF(L22=0,K23,K23+L22)","v":{"v":-59498179.42729612,"d":"-59,498,179 "}},{"$f":"IF(M22=0,L23,L23+M22)","v":{"v":-72005063.74088937,"d":"-72,005,064 "}},{"$f":"IF(N22=0,M23,M23+N22)","v":{"v":-84147669.87059155,"d":"-84,147,670 "}},{"$f":"N23","v":{"v":-84147669.87059155,"d":"-84,147,670 "}}]
[{"$nulls":7},"Omfördelnings-nettonytta",{"$f":"I14+I16","v":{"v":-5737000,"d":"-5,737,000 "}},{"$f":"J14+J16","v":{"v":-10154563.106796117,"d":"-10,154,563 "}},{"v":-14734694.452941848,"d":"-14,734,694 "},{"v":21374971.02626913,"d":"21,374,971 "},{"v":47861698.00868283,"d":"47,861,698 "},{"v":46467667.96959499,"d":"46,467,668 "},{"$f":"O14+O16","v":{"v":85078079.44480899,"d":"85,078,079 "}}]
[{"$nulls":7},"Ackumulerad omfördelnings-nettonytta",{"$f":"I26","v":{"v":-5737000,"d":"-5,737,000 "}},{"$f":"IF(J24=0,I25,I25+J24)","v":{"v":-15891563.106796117,"d":"-15,891,563 "}},{"$f":"IF(K24=0,J25,J25+K24)","v":{"v":-30626257.559737965,"d":"-30,626,258 "}},{"$f":"IF(L24=0,K25,K25+L24)","v":{"v":-9251286.533468835,"d":"-9,251,287 "}},{"$f":"IF(M24=0,L25,L25+M24)","v":{"v":38610411.475214,"d":"38,610,411 "}},{"$f":"IF(N24=0,M25,M25+N24)","v":{"v":85078079.44480899,"d":"85,078,079 "}},{"$f":"N25","v":{"v":85078079.44480899,"d":"85,078,079 "}}]
[{"$nulls":7},"Nettonytta",{"$f":"I12+I16","v":{"v":-5737000,"d":"-5,737,000 "}},{"$f":"J12+J16","v":{"v":-10154563.106796117,"d":"-10,154,563 "}},{"v":-13317547.541545864,"d":"-13,317,548 "},{"$f":"L12+L16","v":{"v":25502583.389558405,"d":"25,502,583 "}},{"$f":"M12+M16","v":{"v":54523388.66164182,"d":"54,523,389 "}},{"v":52935328.797710516,"d":"52,935,329 "},{"$f":"O12+O16","v":{"v":103752190.20056877,"d":"103,752,190 "}}]
[{"$nulls":7},"Ackumulerad nettonytta",{"$f":"I26","v":{"v":-5737000,"d":"-5,737,000 "}},{"$f":"IF(J26=0,I27,I27+J26)","v":{"v":-15891563.106796117,"d":"-15,891,563 "}},{"$f":"IF(K26=0,J27,J27+K26)","v":{"v":-29209110.648341984,"d":"-29,209,111 "}},{"$f":"IF(L26=0,K27,K27+L26)","v":{"v":-3706527.258783579,"d":"-3,706,527 "}},{"$f":"IF(M26=0,L27,L27+M26)","v":{"v":50816861.40285824,"d":"50,816,861 "}},{"$f":"IF(N26=0,M27,M27+N26)","v":{"v":103752190.20056877,"d":"103,752,190 "}},{"$f":"N27","v":{"v":103752190.20056877,"d":"103,752,190 "}}]
{"$rows_empty":29}
[null,null,"Finansiell nytta"]
[]
[]
[null,null,"Nyttorealiseringskalkyl - finansiel nytta",{"$nulls":4},"Nyttorealiseringskalkyl - finansiell nytta"]
[null,null,"För perioden",{"$f":"Startår & \" - \" & Startår+5","v":"2019 - 2024"}]
[{"$nulls":8},{"$f":"Startår","v":2019},{"$f":"I62+1","v":2020},{"$f":"J62+1","v":2021},{"$f":"K62+1","v":2022},{"$f":"L62+1","v":2023},{"$f":"M62+1","v":2024},"Totalt"]
[null,null,"Total kostnad",{"$f":"TotalKostnad","v":{"v":-102821780.62635133,"d":"-102,821,781 kr"}},{"$nulls":3},"Finansiella nyttor",{"$f":"IFERROR(GETPIVOTDATA(\"Summa av år 1\",'-Admin-'!$C$25,\"Nyttokategori\",\"1. Finansiell\"),0)","v":0},{"$f":"IFERROR(GETPIVOTDATA(\"Summa av år 2\",'-Admin-'!$C$25,\"Nyttokategori\",\"1. Finansiell\"),0)","v":0},{"$f":"IFERROR(GETPIVOTDATA(\"Summa av år 3\",'-Admin-'!$C$25,\"Nyttokategori\",\"1. Finansiell\"),0)","v":{"v":1417146.911395984,"d":"1,417,147 "}},{"$f":"IFERROR(GETPIVOTDATA(\"Summa av år 4\",'-Admin-'!$C$25,\"Nyttokategori\",\"1. Finansiell\"),0)","v":{"v":4127612.3632892733,"d":"4,127,612 "}},{"$f":"IFERROR(GETPIVOTDATA(\"Summa av år 5\",'-Admin-'!$C$25,\"Nyttokategori\",\"1. Finansiell\"),0)","v":{"v":6661690.652958992,"d":"6,661,691 "}},{"$f":"IFERROR(GETPIVOTDATA(\"Summa av år 6\",'-Admin-'!$C$25,\"Nyttokategori\",\"1. Finansiell\"),0)","v":{"v":6467660.828115527,"d":"6,467,661 "}},{"$f":"SUM(I63:N63)","v":{"v":18674110.755759776,"d":"18,674,111 "}}]
[null,null,"Total finansiell nytta",{"$f":"O63","v":{"v":18674110.755759776,"d":"18,674,111 kr"}}]
[null,null,"Finansiell nettonytta",{"$f":"O71","v":{"v":-84147669.87059155,"d":"-84,147,670 kr"}},{"$nulls":3},"Total kostnad",{"$f":"SUM(I66:I69)","v":{"v":-5737000,"d":"-5,737,000 "}},{"$f":"SUM(J66:J69)","v":{"v":-10154563.106796117,"d":"-10,154,563 "}},{"v":-28994099.349608824,"d":"-28,994,099 "},{"v":-20157276.245576434,"d":"-20,157,276 "},{"v":-19168574.96655224,"d":"-19,168,575 "},{"v":-18610266.95781771,"d":"-18,610,267 "},{"v":-102821780.62635133,"d":"-102,821,781 "}]
[{"$nulls":7},"Verksamhets-förändring",{"$f":"IFERROR(-GETPIVOTDATA(\"Summa av År 1\",'-Admin-'!$C$32,\"Kostnadskategori\",\"1. Verksamhetsförändring\"),0)","v":0},{"$f":"IFERROR(-GETPIVOTDATA(\"Summa av År 2\",'-Admin-'!$C$32,\"Kostnadskategori\",\"1. Verksamhetsförändring\"),0)","v":0},{"$f":"IFERROR(-GETPIVOTDATA(\"Summa av År 3\",'-Admin-'!$C$32,\"Kostnadskategori\",\"1. Verksamhetsförändring\"),0)","v":{"v":-5510604.203977756,"d":"-5,510,604 "}},{"$f":"IFERROR(-GETPIVOTDATA(\"Summa av År 4\",'-Admin-'!$C$32,\"Kostnadskategori\",\"1. Verksamhetsförändring\"),0)","v":{"v":-5272314.1278654225,"d":"-5,272,314 "}},{"$f":"IFERROR(-GETPIVOTDATA(\"Summa av År 5\",'-Admin-'!$C$32,\"Kostnadskategori\",\"1. Verksamhetsförändring\"),0)","v":{"v":-4852205.466077161,"d":"-4,852,205 "}},{"$f":"IFERROR(-GETPIVOTDATA(\"Summa av År 6\",'-Admin-'!$C$32,\"Kostnadskategori\",\"1. Verksamhetsförändring\"),0)","v":{"v":-4710879.093278797,"d":"-4,710,879 "}},{"$f":"SUM(I66:N66)","v":{"v":-20346002.891199134,"d":"-20,346,003 "}}]
[null,null,"Return on investment (ROI)",{"$f":"IF(-O65=0,0,O71/-O65)","v":{"v":-0.8183837058451607,"d":"-0.82 kr"}},{"$nulls":3},"Löpande verksamhets-kostnader",{"$f":"IFERROR(-GETPIVOTDATA(\"Summa av År 1\",'-Admin-'!$C$32,\"Kostnadskategori\",\"2. Löpande verksamhetskostnader\"),0)","v":0},{"$f":"IFERROR(-GETPIVOTDATA(\"Summa av År 2\",'-Admin-'!$C$32,\"Kostnadskategori\",\"2. Löpande verksamhetskostnader\"),0)","v":{"v":-1416699.0291262136,"d":"-1,416,699 "}},{"$f":"IFERROR(-GETPIVOTDATA(\"Summa av År 3\",'-Admin-'!$C$32,\"Kostnadskategori\",\"2. Löpande verksamhetskostnader\"),0)","v":{"v":-19713111.50909605,"d":"-19,713,112 "}},{"$f":"IFERROR(-GETPIVOTDATA(\"Summa av År 4\",'-Admin-'!$C$32,\"Kostnadskategori\",\"2. Löpande verksamhetskostnader\"),0)","v":{"v":-14884962.117711011,"d":"-14,884,962 "}},{"$f":"IFERROR(-GETPIVOTDATA(\"Summa av År 5\",'-Admin-'!$C$32,\"Kostnadskategori\",\"2. Löpande verksamhetskostnader\"),0)","v":{"v":-14316369.500475079,"d":"-14,316,370 "}},{"$f":"IFERROR(-GETPIVOTDATA(\"Summa av År 6\",'-Admin-'!$C$32,\"Kostnadskategori\",\"2. Löpande verksamhetskostnader\"),0)","v":{"v":-13899387.864538914,"d":"-13,899,388 "}},{"$f":"SUM(I67:N67)","v":{"v":-64230530.02094727,"d":"-64,230,530 "}}]
[null,null,"Payback-år",{"$f":"'-Admin-'!D112","v":"Ingen payback"},{"$nulls":3},"Investeringar",{"$f":"IFERROR(-GETPIVOTDATA(\"Summa av År 1\",'-Admin-'!$C$32,\"Kostnadskategori\",\"3. Investeringar\"),0)","v":0},{"$f":"IFERROR(-GETPIVOTDATA(\"Summa av År 2\",'-Admin-'!$C$32,\"Kostnadskategori\",\"3. Investeringar\"),0)","v":0},{"$f":"IFERROR(-GETPIVOTDATA(\"Summa av År 3\",'-Admin-'!$C$32,\"Kostnadskategori\",\"3. Investeringar\"),0)","v":0},{"$f":"IFERROR(-GETPIVOTDATA(\"Summa av År 4\",'-Admin-'!$C$32,\"Kostnadskategori\",\"3. Investeringar\"),0)","v":0},{"$f":"IFERROR(-GETPIVOTDATA(\"Summa av År 5\",'-Admin-'!$C$32,\"Kostnadskategori\",\"3. Investeringar\"),0)","v":0},{"$f":"IFERROR(-GETPIVOTDATA(\"Summa av År 6\",'-Admin-'!$C$32,\"Kostnadskategori\",\"3. Investeringar\"),0)","v":0},{"$f":"SUM(I68:N68)","v":0}]
[{"$nulls":7},"Projekt",{"$f":"IFERROR(-GETPIVOTDATA(\"Summa av År 1\",'-Admin-'!$C$32,\"Kostnadskategori\",\"4. Projekt\"),0)","v":{"v":-5737000,"d":"-5,737,000 "}},{"$f":"IFERROR(-GETPIVOTDATA(\"Summa av År 2\",'-Admin-'!$C$32,\"Kostnadskategori\",\"4. Projekt\"),0)","v":{"v":-8737864.077669904,"d":"-8,737,864 "}},{"$f":"IFERROR(-GETPIVOTDATA(\"Summa av År 3\",'-Admin-'!$C$32,\"Kostnadskategori\",\"4. Projekt\"),0)","v":{"v":-3770383.6365350178,"d":"-3,770,384 "}},{"$f":"IFERROR(-GETPIVOTDATA(\"Summa av År 4\",'-Admin-'!$C$32,\"Kostnadskategori\",\"4. Projekt\"),0)","v":0},{"$f":"IFERROR(-GETPIVOTDATA(\"Summa av År 5\",'-Admin-'!$C$32,\"Kostnadskategori\",\"4. Projekt\"),0)","v":0},{"$f":"IFERROR(-GETPIVOTDATA(\"Summa av År 6\",'-Admin-'!$C$32,\"Kostnadskategori\",\"4. Projekt\"),0)","v":0},{"v":-18245247.714204922,"d":"-18,245,248 "}]
[]
[{"$nulls":7},"Finansiell nettonytta",{"$f":"I63+I65","v":{"v":-5737000,"d":"-5,737,000 "}},{"v":-10154563.106796117,"d":"-10,154,563 "},{"v":-27576952.438212838,"d":"-27,576,952 "},{"$f":"L63+L65","v":{"v":-16029663.88228716,"d":"-16,029,664 "}},{"v":-12506884.313593246,"d":"-12,506,884 "},{"v":-12142606.129702184,"d":"-12,142,606 "},{"$f":"O63+O65","v":{"v":-84147669.87059155,"d":"-84,147,670 "}}]
[{"$nulls":7},"Ackumulerad finansiell nettonytta",{"$f":"I63+I65","v":{"v":-5737000,"d":"-5,737,000 "}},{"$f":"IF(J71=0,I72,I72+J71)","v":{"v":-15891563.106796117,"d":"-15,891,563 "}},{"$f":"IF(K71=0,J72,J72+K71)","v":{"v":-43468515.54500896,"d":"-43,468,516 "}},{"$f":"IF(L71=0,K72,K72+L71)","v":{"v":-59498179.42729612,"d":"-59,498,179 "}},{"$f":"IF(M71=0,L72,L72+M71)","v":{"v":-72005063.74088937,"d":"-72,005,064 "}},{"$f":"IF(N71=0,M72,M72+N71)","v":{"v":-84147669.87059155,"d":"-84,147,670 "}},{"$f":"N72","v":{"v":-84147669.87059155,"d":"-84,147,670 "}}]
{"$rows_empty":35}
[null,null,"Omfördelningsnytta"]
[]
[]
[null,null,"Nyttorealiseringskalkyl - omfördelningsnytta",{"$nulls":4},"Nyttorealiseringskalkyl per år"]
[null,null,"För perioden",{"$f":"Startår & \" - \" & Startår+5","v":"2019 - 2024"}]
[{"$nulls":8},{"$f":"Startår","v":2019},{"$f":"I113+1","v":2020},{"$f":"J113+1","v":2021},{"$f":"K113+1","v":2022},{"$f":"L113+1","v":2023},{"$f":"M113+1","v":2024},"Totalt"]
[null,null,"Total kostnad",{"$f":"TotalKostnad","v":{"v":-102821780.62635133,"d":"-102,821,781 "}},{"$nulls":3},"Omfördelningsnyttor",{"$f":"IFERROR(GETPIVOTDATA(\"Summa av år 1\",'-Admin-'!$C$25,\"Nyttokategori\",\"2. Omfördelningsnytta\"),0)","v":0},{"$f":"IFERROR(GETPIVOTDATA(\"Summa av år 2\",'-Admin-'!$C$25,\"Nyttokategori\",\"2. Omfördelningsnytta\"),0)","v":0},{"$f":"IFERROR(GETPIVOTDATA(\"Summa av år 3\",'-Admin-'!$C$25,\"Nyttokategori\",\"2. Omfördelningsnytta\"),0)","v":{"v":14259404.896666976,"d":"14,259,405 "}},{"$f":"IFERROR(GETPIVOTDATA(\"Summa av år 4\",'-Admin-'!$C$25,\"Nyttokategori\",\"2. Omfördelningsnytta\"),0)","v":{"v":41532247.271845564,"d":"41,532,247 "}},{"$f":"IFERROR(GETPIVOTDATA(\"Summa av år 5\",'-Admin-'!$C$25,\"Nyttokategori\",\"2. Omfördelningsnytta\"),0)","v":{"v":67030272.97523507,"d":"67,030,273 "}},{"$f":"IFERROR(GETPIVOTDATA(\"Summa av år 6\",'-Admin-'!$C$25,\"Nyttokategori\",\"2. Omfördelningsnytta\"),0)","v":{"v":65077934.9274127,"d":"65,077,935 "}},{"$f":"SUM(I114:N114)","v":{"v":187899860.07116032,"d":"187,899,860 "}}]
[null,null,"Total omfördelningsnytta",{"$f":"O114","v":{"v":187899860.07116032,"d":"187,899,860 "}}]
[null,null,"Omfördelnings-nettonytta",{"$f":"O122","v":{"v":85078079.44480899,"d":"85,078,079 "}},{"$nulls":3},"Total kostnad",{"$f":"SUM(I117:I120)","v":{"v":-5737000,"d":"-5,737,000 "}},{"$f":"SUM(J117:J120)","v":{"v":-10154563.106796117,"d":"-10,154,563 "}},{"v":-28994099.349608824,"d":"-28,994,099 "},{"v":-20157276.245576434,"d":"-20,157,276 "},{"v":-19168574.96655224,"d":"-19,168,575 "},{"v":-18610266.95781771,"d":"-18,610,267 "},{"v":-102821780.62635133,"d":"-102,821,781 "}]
[{"$nulls":7},"Verksamhets-förändring",{"$f":"IFERROR(-GETPIVOTDATA(\"Summa av År 1\",'-Admin-'!$C$32,\"Kostnadskategori\",\"1. Verksamhetsförändring\"),0)","v":0},{"$f":"IFERROR(-GETPIVOTDATA(\"Summa av År 2\",'-Admin-'!$C$32,\"Kostnadskategori\",\"1. Verksamhetsförändring\"),0)","v":0},{"$f":"IFERROR(-GETPIVOTDATA(\"Summa av År 3\",'-Admin-'!$C$32,\"Kostnadskategori\",\"1. Verksamhetsförändring\"),0)","v":{"v":-5510604.203977756,"d":"-5,510,604 "}},{"$f":"IFERROR(-GETPIVOTDATA(\"Summa av År 4\",'-Admin-'!$C$32,\"Kostnadskategori\",\"1. Verksamhetsförändring\"),0)","v":{"v":-5272314.1278654225,"d":"-5,272,314 "}},{"$f":"IFERROR(-GETPIVOTDATA(\"Summa av År 5\",'-Admin-'!$C$32,\"Kostnadskategori\",\"1. Verksamhetsförändring\"),0)","v":{"v":-4852205.466077161,"d":"-4,852,205 "}},{"$f":"IFERROR(-GETPIVOTDATA(\"Summa av År 6\",'-Admin-'!$C$32,\"Kostnadskategori\",\"1. Verksamhetsförändring\"),0)","v":{"v":-4710879.093278797,"d":"-4,710,879 "}},{"$f":"SUM(I117:N117)","v":{"v":-20346002.891199134,"d":"-20,346,003 "}}]
[null,null,"Return on investment (ROI)",{"$f":"IF(-O116=0,0,O122/-O116)","v":{"v":0.8274324654421035,"d":"0.83 kr"}},{"$nulls":3},"Löpande verksamhets-kostnader",{"$f":"IFERROR(-GETPIVOTDATA(\"Summa av År 1\",'-Admin-'!$C$32,\"Kostnadskategori\",\"2. Löpande verksamhetskostnader\"),0)","v":0},{"$f":"IFERROR(-GETPIVOTDATA(\"Summa av År 2\",'-Admin-'!$C$32,\"Kostnadskategori\",\"2. Löpande verksamhetskostnader\"),0)","v":{"v":-1416699.0291262136,"d":"-1,416,699 "}},{"$f":"IFERROR(-GETPIVOTDATA(\"Summa av År 3\",'-Admin-'!$C$32,\"Kostnadskategori\",\"2. Löpande verksamhetskostnader\"),0)","v":{"v":-19713111.50909605,"d":"-19,713,112 "}},{"$f":"IFERROR(-GETPIVOTDATA(\"Summa av År 4\",'-Admin-'!$C$32,\"Kostnadskategori\",\"2. Löpande verksamhetskostnader\"),0)","v":{"v":-14884962.117711011,"d":"-14,884,962 "}},{"$f":"IFERROR(-GETPIVOTDATA(\"Summa av År 5\",'-Admin-'!$C$32,\"Kostnadskategori\",\"2. Löpande verksamhetskostnader\"),0)","v":{"v":-14316369.500475079,"d":"-14,316,370 "}},{"$f":"IFERROR(-GETPIVOTDATA(\"Summa av År 6\",'-Admin-'!$C$32,\"Kostnadskategori\",\"2. Löpande verksamhetskostnader\"),0)","v":{"v":-13899387.864538914,"d":"-13,899,388 "}},{"$f":"SUM(I118:N118)","v":{"v":-64230530.02094727,"d":"-64,230,530 "}}]
[null,null,"Payback-år",{"$f":"IF('-Admin-'!D119=0,\"Ingen payback\",'-Admin-'!D119)","v":2023},{"$nulls":3},"Investeringar",{"$f":"IFERROR(-GETPIVOTDATA(\"Summa av År 1\",'-Admin-'!$C$32,\"Kostnadskategori\",\"3. Investeringar\"),0)","v":0},{"$f":"IFERROR(-GETPIVOTDATA(\"Summa av År 2\",'-Admin-'!$C$32,\"Kostnadskategori\",\"3. Investeringar\"),0)","v":0},{"$f":"IFERROR(-GETPIVOTDATA(\"Summa av År 3\",'-Admin-'!$C$32,\"Kostnadskategori\",\"3. Investeringar\"),0)","v":0},{"$f":"IFERROR(-GETPIVOTDATA(\"Summa av År 4\",'-Admin-'!$C$32,\"Kostnadskategori\",\"3. Investeringar\"),0)","v":0},{"$f":"IFERROR(-GETPIVOTDATA(\"Summa av År 5\",'-Admin-'!$C$32,\"Kostnadskategori\",\"3. Investeringar\"),0)","v":0},{"$f":"IFERROR(-GETPIVOTDATA(\"Summa av År 6\",'-Admin-'!$C$32,\"Kostnadskategori\",\"3. Investeringar\"),0)","v":0},{"$f":"SUM(I119:N119)","v":0}]
[{"$nulls":7},"Projekt",{"$f":"IFERROR(-GETPIVOTDATA(\"Summa av År 1\",'-Admin-'!$C$32,\"Kostnadskategori\",\"4. Projekt\"),0)","v":{"v":-5737000,"d":"-5,737,000 "}},{"$f":"IFERROR(-GETPIVOTDATA(\"Summa av År 2\",'-Admin-'!$C$32,\"Kostnadskategori\",\"4. Projekt\"),0)","v":{"v":-8737864.077669904,"d":"-8,737,864 "}},{"$f":"IFERROR(-GETPIVOTDATA(\"Summa av År 3\",'-Admin-'!$C$32,\"Kostnadskategori\",\"4. Projekt\"),0)","v":{"v":-3770383.6365350178,"d":"-3,770,384 "}},{"$f":"IFERROR(-GETPIVOTDATA(\"Summa av År 4\",'-Admin-'!$C$32,\"Kostnadskategori\",\"4. Projekt\"),0)","v":0},{"$f":"IFERROR(-GETPIVOTDATA(\"Summa av År 5\",'-Admin-'!$C$32,\"Kostnadskategori\",\"4. Projekt\"),0)","v":0},{"$f":"IFERROR(-GETPIVOTDATA(\"Summa av År 6\",'-Admin-'!$C$32,\"Kostnadskategori\",\"4. Projekt\"),0)","v":0},{"v":-18245247.714204922,"d":"-18,245,248 "}]
[]
[{"$nulls":7},"Omfördelnings-nettonytta",{"$f":"I114+I116","v":{"v":-5737000,"d":"-5,737,000 "}},{"v":-10154563.106796117,"d":"-10,154,563 "},{"v":-14734694.452941848,"d":"-14,734,694 "},{"v":21374971.02626913,"d":"21,374,971 "},{"v":47861698.00868283,"d":"47,861,698 "},{"v":46467667.96959499,"d":"46,467,668 "},{"v":85078079.44480899,"d":"85,078,079 "}]
[{"$nulls":7},"Ackumulerad omfördelnings-nettonytta",{"$f":"I124","v":0},{"$f":"IF(J122=0,I123,I123+J122)","v":{"v":-10154563.106796117,"d":"-10,154,563 "}},{"$f":"IF(K122=0,J123,J123+K122)","v":{"v":-24889257.559737965,"d":"-24,889,258 "}},{"$f":"IF(L122=0,K123,K123+L122)","v":{"v":-3514286.533468835,"d":"-3,514,287 "}},{"$f":"IF(M122=0,L123,L123+M122)","v":{"v":44347411.475214,"d":"44,347,411 "}},{"$f":"IF(N122=0,M123,M123+N122)","v":{"v":90815079.44480899,"d":"90,815,079 "}},{"$f":"N123","v":{"v":90815079.44480899,"d":"90,815,079 "}}]

{"sheet":"Data antal samtal","index":5,"n_rows":23,"n_cols":5,"rows_kept":23,"merged":[[0,6,0,7]]}
["Planerat införande","Region","Besvarade samtal 2019 (Sörmland och Värmland från 2020)","5 % per månad -bild","5 % per månad -vide"]
["Bild","Blekinge",{"v":77367,"d":"77,367"},{"$f":"(C2*0.05)/12","v":{"v":322.3625,"d":"322 "}}]
["Bild och video","Dalarna",{"v":107767,"d":"107,767"},{"$f":"(C3*0.05)/12","v":{"v":449.0291666666667,"d":"449 "}},{"$f":"(C3*0.05)/12","v":{"v":449.0291666666667,"d":"449 "}}]
["Bild och video","Gotland",{"v":36251,"d":"36,251"},{"v":151.04583333333335,"d":"151 "},{"v":151.04583333333335,"d":"151 "}]
["Bild och video","Halland",{"v":89583,"d":"89,583"},{"v":373.26250000000005,"d":"373 "},{"v":373.26250000000005,"d":"373 "}]
["Bild och video","Jämtland",{"v":63539,"d":"63,539"},{"v":264.74583333333334,"d":"265 "},{"v":264.74583333333334,"d":"265 "}]
["Bild och video","Jönköpings län",{"v":124986,"d":"124,986"},{"v":520.775,"d":"521 "},{"v":520.775,"d":"521 "}]
["Bild och video","Kalmar län",{"v":78089,"d":"78,089"},{"v":325.37083333333334,"d":"325 "},{"v":325.37083333333334,"d":"325 "}]
["Bild och video","Kronoberg",{"v":91894,"d":"91,894"},{"v":382.89166666666665,"d":"383 "},{"v":382.89166666666665,"d":"383 "}]
["Bild","Norrbotten",{"v":88139,"d":"88,139"},{"v":367.24583333333334,"d":"367 "}]
["Bild och video","Skåne",{"v":302288,"d":"302,288"},{"v":1259.5333333333335,"d":"1,260 "},{"v":1259.5333333333335,"d":"1,260 "}]
["Bild och video","Sörmland (2020)",{"v":118561,"d":"118,561"},{"v":494.00416666666666,"d":"494 "},{"v":494.00416666666666,"d":"494 "}]
["Bild och video","Uppsala",{"v":147743,"d":"147,743"},{"v":615.5958333333334,"d":"616 "},{"v":615.5958333333334,"d":"616 "}]
["Bild och video","Värmland (2020",{"v":127382,"d":"127,382"},{"v":530.7583333333333,"d":"531 "},{"v":530.7583333333333,"d":"531 "}]
["Bild","Västerbotten",{"v":131098,"d":"131,098"},{"v":546.2416666666667,"d":"546 "}]
["Bild och video","Västernorrland",{"v":124424,"d":"124,424"},{"v":518.4333333333334,"d":"518 "},{"v":518.4333333333334,"d":"518 "}]
["Bild och video","Västmanland",{"v":118457,"d":"118,457"},{"v":493.5708333333334,"d":"494 "},{"v":493.5708333333334,"d":"494 "}]
["Bild och video","Västra Götaland",{"v":586408,"d":"586,408"},{"v":2443.366666666667,"d":"2,443 "},{"v":2443.366666666667,"d":"2,443 "}]
["Bild och video","Örebro län",{"v":127152,"d":"127,152"},{"v":529.8000000000001,"d":"530 "},{"v":529.8000000000001,"d":"530 "}]
["Bild och video","Östergötland",{"v":187253,"d":"187,253"},{"v":780.2208333333333,"d":"780 "},{"v":780.2208333333333,"d":"780 "}]
[]
[null,"Antal besvarade för regioner som inför bild",{"$f":"SUM(C2:C20)","v":{"v":2728381,"d":"2,728,381"}},{"$f":"SUM(D2:D20)","v":{"v":11368.254166666666,"d":"11,368"}},{"v":10132.404166666667,"d":"10,132"}]
[null,"Antal besvarade för regioner som inför video",{"$f":"SUM(C2:C20)-C10-C2-C15","v":{"v":2431777,"d":"2,431,777"}},{"$f":"SUM(D2:D20)-D10-D2-D15","v":{"v":10132.404166666667,"d":"10,132"}},{"v":10132.404166666667,"d":"10,132"}]

{"sheet":"-Admin-","index":6,"n_rows":120,"n_cols":16,"rows_kept":120,"hidden":true}
[null,null,"Admin"]
[null,null,"I den här fliken finns stödfunktioner som används i kalkylen. Redigera dem bara om du är säker på att du vill ändra hur mallen fungerar. "]
[]
[]
[null,null,"Underlag för rullister i mallen"]
[null,null,"Fördefinierade värden i rullisterna"]
[null,null,"Grunden för att kunna redovisa nyttokalkylen uppdelad på typ av nytta. "]
[]
[null,null,"Nyttokategori"]
[null,null,"1. Finansiell"]
[null,null,"2. Omfördelningsnytta"]
[null,null,"3. Kvalitativ, mätbar"]
[]
[null,null,"Kostnadskategori"]
[null,null,"1. Verksamhetsförändring"]
[null,null,"2. Löpande verksamhetskostnader"]
[null,null,"3. Investeringar"]
[null,null,"4. Projekt"]
[]
[]
[null,null,"Underlag för nyttokalkylen"]
[]
[null,null,"PivotNytta"]
[null,null,"Nyttor"]
[null,null,"Radetiketter","Summa av år 1","Summa av År 2","Summa av År 3","Summa av År 4","Summa av År 5","Summa av År 6"]
[null,null,"2. Omfördelningsnytta",0,0,{"v":14259404.896666976,"d":"14,259,405 "},{"v":41532247.271845564,"d":"41,532,247 "},{"v":67030272.97523507,"d":"67,030,273 "},{"v":65077934.9274127,"d":"65,077,935 "}]
[null,null,"1. Finansiell",0,0,{"v":1417146.911395984,"d":"1,417,147 "},{"v":4127612.3632892733,"d":"4,127,612 "},{"v":6661690.652958992,"d":"6,661,691 "},{"v":6467660.828115527,"d":"6,467,661 "}]
[null,null,0,0,0,0,0,0,0]
[]
[null,null,"PivotKostnad"]
[null,null,"Kostnader"]
[null,null,"Radetiketter","Summa av År 1","Summa av År 2","Summa av År 3","Summa av År 4","Summa av År 5","Summa av År 6"]
[null,null,0,0,0,0,0,0,0]
[null,null,"2. Löpande verksamhetskostnader",0,{"v":1416699.0291262136,"d":"1,416,699 "},{"v":19713111.50909605,"d":"19,713,112 "},{"v":14884962.117711011,"d":"14,884,962 "},{"v":14316369.500475079,"d":"14,316,370 "},{"v":13899387.864538914,"d":"13,899,388 "}]
[null,null,"1. Verksamhetsförändring",0,0,{"v":5510604.203977756,"d":"5,510,604 "},{"v":5272314.1278654225,"d":"5,272,314 "},{"v":4852205.466077161,"d":"4,852,205 "},{"v":4710879.093278797,"d":"4,710,879 "}]
[null,null,"4. Projekt",{"v":5737000,"d":"5,737,000 "},{"v":8737864.077669904,"d":"8,737,864 "},{"v":3770383.6365350178,"d":"3,770,384 "},0,0,0]
[]
[]
[]
[null,null,"Underlag för  några av diagrammen - övriga diagram hämtar sin data från sammanställningen på fliken Nyttokalkyl"]
[]
[null,null,"Diagram \"Nyttor och kostnader\""]
[]
[{"$nulls":3},"Finansiell nytta","Omfördelningsnytta","Total nytta","Kostnad"]
[null,null,"Nytta",{"$f":"Nyttokalkyl!$O$13","v":{"v":18674110.755759776,"d":"18,674,111 "}},{"$f":"Nyttokalkyl!O14","v":{"v":187899860.07116032,"d":"187,899,860 "}},{"$f":"D45+E45","v":{"v":206573970.8269201,"d":"206,573,971 "}}]
[null,null,"Kostnad",{"$nulls":3},{"$f":"-1*TotalKostnad","v":{"v":102821780.62635133,"d":"102,821,781 "}}]
[]
[null,null,"PivotNyttaIntressent",null,null,"PivotKostnadIntressent",null,null,"PivotFinansiellNyttaIntressent",null,null,"PivotOmfördelningsnyttaIntressent"]
[null,null,"Diagram \"Nytta per intressent\"",null,null,"Diagram \"Kostnad per intressent\"",null,null,"Diagram \"Finansiell nytta per intressent\"",null,null,"Diagram \"Omfördelningsnytta nytta per intressent\""]
[null,null,"Nyttokategori","(flera objekt)",null,"Kostnadskategori","(flera objekt)",null,"Nyttokategori","1. Finansiell",null,"Nyttokategori","2. Omfördelningsnytta"]
[]
[null,null,"Radetiketter","Summa av Summa trolig",null,"Radetiketter","Summa av Summa",null,"Radetiketter","Summa av Summa trolig",null,"Radetiketter","Summa av Summa trolig"]
[null,null,"Regioner",{"v":163374527.94526246,"d":"163,374,528 "},null,"Staten",{"v":25704590.44207748,"d":"25,704,590 "},null,"Invånare",{"v":18674110.755759776,"d":"18,674,111 "},null,"Regioner",{"v":163374527.94526246,"d":"163,374,528 "}]
[null,null,"Invånare",{"v":43199442.88165762,"d":"43,199,443 "},null,"Regioner",{"v":72222190.18427384,"d":"72,222,190 "},null,"Totalsumma",{"v":18674110.755759776,"d":"18,674,111 "},null,"Invånare",{"v":24525332.125897847,"d":"24,525,332 "}]
[null,null,"Totalsumma",{"v":206573970.8269201,"d":"206,573,971 "},null,"Inera",{"v":4895000,"d":"4,895,000 "},{"$nulls":4},"Totalsumma",{"v":187899860.07116032,"d":"187,899,860 "}]
[{"$nulls":5},"Totalsumma",{"v":102821780.62635133,"d":"102,821,781 "}]
{"$rows_empty":10}
[null,null,"PivotNyttaOsäkerhet",{"$nulls":5},"PivotKostnadOsäkerhet"]
[null,null,"PivotNytta - underlag till diagram \"osäkerhetsanalys\" ",{"$nulls":5},"PivotKostnad - underlag till diagram \"osäkerhetsanalys\" "]
[null,null,"Radetiketter","Summa av Summa min","Summa av Summa trolig","Summa av Summa max",null,null,"Radetiketter","Summa av Min","Summa av Summa","Summa av Max"]
[null,null,0,0,0,0,null,null,"2. Löpande verksamhetskostnader",{"v":51384424.016757816,"d":"51,384,424 "},{"v":64230530.020947255,"d":"64,230,530 "},{"v":77076636.02513671,"d":"77,076,636 "}]
[null,null,"2. Omfördelningsnytta",{"v":130171548.60150498,"d":"130,171,549 "},{"v":187899860.07116032,"d":"187,899,860 "},{"v":251343255.38392326,"d":"251,343,255 "},null,null,"1. Verksamhetsförändring",{"v":16276802.312959312,"d":"16,276,802 "},{"v":20346002.89119914,"d":"20,346,003 "},{"v":24415203.469438966,"d":"24,415,203 "}]
[null,null,"1. Finansiell",{"v":13338650.539828414,"d":"13,338,651 "},{"v":18674110.755759776,"d":"18,674,111 "},{"v":25755089.22746455,"d":"25,755,089 "},null,null,"4. Projekt",{"v":14596198.171363937,"d":"14,596,198 "},{"v":18245247.714204922,"d":"18,245,248 "},{"v":21894297.257045902,"d":"21,894,297 "}]
[null,null,"Totalsumma",{"v":143510199.1413334,"d":"143,510,199 "},{"v":206573970.8269201,"d":"206,573,971 "},{"v":277098344.6113878,"d":"277,098,345 "},null,null,"Totalsumma",{"v":82257424.50108106,"d":"82,257,425 "},{"v":102821780.62635131,"d":"102,821,781 "},{"v":123386136.75162157,"d":"123,386,137 "}]
[]
[]
[]
[null,null,"Diagram \"Osäkerhetsanalys\" Alla nyttor"]
[{"$nulls":3},"Nytta","Kostnad","Nettonytta"]
[null,null,"Min",{"$f":"IFERROR(GETPIVOTDATA(\"Summa av Summa min\",$C$69),0)","v":{"v":143510199.1413334,"d":"143,510,199 "}},{"$f":"GETPIVOTDATA(\"Summa av Min\",$I$69)","v":{"v":82257424.50108106,"d":"82,257,425 "}},{"$f":"D79-E81","v":{"v":20124062.389711827,"d":"20,124,062 "}}]
[null,null,"Troligt",{"$f":"IFERROR(GETPIVOTDATA(\"Summa av Summa trolig\",$C$69),0)","v":{"v":206573970.8269201,"d":"206,573,971 "}},{"$f":"GETPIVOTDATA(\"Summa av Summa\",$I$69)","v":{"v":102821780.62635131,"d":"102,821,781 "}},{"$f":"D80-E80","v":{"v":103752190.20056878,"d":"103,752,190 "}},null,null,"Fördelning av nyttor"]
[null,null,"Max",{"$f":"IFERROR(GETPIVOTDATA(\"Summa av Summa max\",$C$69),0)","v":{"v":277098344.6113878,"d":"277,098,345 "}},{"$f":"GETPIVOTDATA(\"Summa av Max\",$I$69)","v":{"v":123386136.75162157,"d":"123,386,137 "}},{"$f":"D81-E79","v":{"v":194840920.11030674,"d":"194,840,920 "}},null,null,"Summa av Summa trolig","Kolumnetiketter"]
[{"$nulls":8},"Radetiketter","Bild - frigjorda vårdbesök","Bild - sparar tid för invånare","Bild - sparar pengar för invånare","Video - frigjorda vårdbesök","Video - sparar tid","Video - sparar pengar","Totalsumma"]
[{"$nulls":8},"Regioner",{"v":78658728.41541499,"d":"78,658,728 "},null,null,{"v":84715799.52984747,"d":"84,715,800 "},null,null,{"v":163374527.94526246,"d":"163,374,528 "}]
[null,null,"Diagram \"Osäkerhetsanalys\" Finansiella nyttor",{"$nulls":5},"Invånare",null,{"v":11808030.684166346,"d":"11,808,031 "},{"v":8990886.307740869,"d":"8,990,886 "},null,{"v":12717301.4417315,"d":"12,717,301 "},{"v":9683224.448018909,"d":"9,683,224 "},{"v":43199442.88165762,"d":"43,199,443 "}]
[{"$nulls":3},"Finansiell nytta","Kostnad","Nettonytta",null,null,"Totalsumma",{"v":78658728.41541499,"d":"78,658,728 "},{"v":11808030.684166346,"d":"11,808,031 "},{"v":8990886.307740869,"d":"8,990,886 "},{"v":84715799.52984747,"d":"84,715,800 "},{"v":12717301.4417315,"d":"12,717,301 "},{"v":9683224.448018909,"d":"9,683,224 "},{"v":206573970.8269201,"d":"206,573,971 "}]
[null,null,"Min",{"$f":"IFERROR(GETPIVOTDATA(\"Summa av Summa min\",$C$69,\"Nyttokategori\",\"1. Finansiell\"),0)","v":{"v":13338650.539828414,"d":"13,338,651 "}},{"$f":"GETPIVOTDATA(\"Summa av Min\",$I$69)","v":{"v":82257424.50108106,"d":"82,257,425 "}},{"$f":"D86-E88","v":{"v":-110047486.21179315,"d":"-110,047,486 "}}]
[null,null,"Troligt",{"$f":"IFERROR(GETPIVOTDATA(\"Summa av Summa trolig\",$C$69,\"Nyttokategori\",\"1. Finansiell\"),0)","v":{"v":18674110.755759776,"d":"18,674,111 "}},{"$f":"GETPIVOTDATA(\"Summa av Summa\",$I$69)","v":{"v":102821780.62635131,"d":"102,821,781 "}},{"$f":"D87-E87","v":{"v":-84147669.87059154,"d":"-84,147,670 "}}]
[null,null,"Max",{"$f":"IFERROR(GETPIVOTDATA(\"Summa av Summa max\",$C$69,\"Nyttokategori\",\"1. Finansiell\"),0)","v":{"v":25755089.22746455,"d":"25,755,089 "}},{"$f":"GETPIVOTDATA(\"Summa av Max\",$I$69)","v":{"v":123386136.75162157,"d":"123,386,137 "}},{"$f":"D88-E86","v":{"v":-56502335.273616515,"d":"-56,502,335 "}}]
[]
[]
[null,null,"Diagram \"Osäkerhetsanalys\" Omfördelningsnyttor"]
[{"$nulls":3},"Omfördelningsnytta","Kostnad","Nettonytta"]
[null,null,"Min",{"$f":"IFERROR(GETPIVOTDATA(\"Summa av Summa min\",$C$69,\"Nyttokategori\",\"2. Omfördelningsnytta\"),0)","v":{"v":130171548.60150498,"d":"130,171,549 "}},{"$f":"Kostnader[[#Totals],[Min]]","v":{"v":82257424.50108106,"d":"82,257,425 "}},{"$f":"D93-E95","v":{"v":6785411.849883407,"d":"6,785,412 "}}]
[null,null,"Troligt",{"$f":"IFERROR(GETPIVOTDATA(\"Summa av Summa trolig\",$C$69,\"Nyttokategori\",\"2. Omfördelningsnytta\"),0)","v":{"v":187899860.07116032,"d":"187,899,860 "}},{"$f":"Kostnader[[#Totals],[Summa]]","v":{"v":102821780.62635133,"d":"102,821,781 "}},{"$f":"D94-E94","v":{"v":85078079.44480899,"d":"85,078,079 "}}]
[null,null,"Max",{"$f":"IFERROR(GETPIVOTDATA(\"Summa av Summa max\",$C$69,\"Nyttokategori\",\"2. Omfördelningsnytta\"),0)","v":{"v":251343255.38392326,"d":"251,343,255 "}},{"$f":"Kostnader[[#Totals],[Max]]","v":{"v":123386136.75162157,"d":"123,386,137 "}},{"$f":"D95-E93","v":{"v":169085830.88284218,"d":"169,085,831 "}}]
[]
[]
[null,null,"Underlag för payback-år"]
[null,null,"Alla nyttor"]
[null,null,"Följande rader används för beräkning av Payback-år",{"$f":"Startår","v":2019},{"$f":"D100+1","v":2020},{"$f":"E100+1","v":2021},2022,2023,2024]
[null,null,"Ack. diskonterat kassaflöde > 0?",{"$f":"Nyttokalkyl!I27>0","v":false},{"$f":"Nyttokalkyl!J27>0","v":false},{"$f":"Nyttokalkyl!K27>0","v":false},{"$f":"Nyttokalkyl!L27>0","v":false},{"$f":"Nyttokalkyl!M27>0","v":true},{"$f":"Nyttokalkyl!N27>0","v":true}]
[null,null,"Är detta ett paybackår?",{"$f":"IF(D101=FALSE,\"x\",D100)","v":"x"},{"$f":"IF(E101=FALSE,\"x\",E100)","v":"x"},"x","x",{"v":2023,"d":"2,023 "},{"v":2024,"d":"2,024 "}]
[null,null,"Första paybackår (om något)",{"$f":"MIN(D102:I102)","v":{"v":2023,"d":"2,023 "}}]
[null,null,"Paybackår?",{"$f":"IF('-Admin-'!D103=0,\"Ingen payback\",'-Admin-'!D103)","v":2023}]
[]
[]
[null,null,"Finansiella nyttor"]
[null,null,"Följande rader används för beräkning av Payback-år",{"$f":"Startår","v":2019},{"$f":"D108+1","v":2020},{"$f":"E108+1","v":2021},{"$f":"F108+1","v":2022},{"$f":"G108+1","v":2023},{"$f":"H108+1","v":2024}]
[null,null,"Ack. diskonterat kassaflöde > 0?",{"$f":"Nyttokalkyl!I72>0","v":false},{"$f":"Nyttokalkyl!J72>0","v":false},{"$f":"Nyttokalkyl!K72>0","v":false},{"$f":"Nyttokalkyl!L72>0","v":false},{"$f":"Nyttokalkyl!M72>0","v":false},{"$f":"Nyttokalkyl!N72>0","v":false}]
[null,null,"Är detta ett paybackår?",{"$f":"IF(D109=FALSE,\"x\",D108)","v":"x"},{"$f":"IF(E109=FALSE,\"x\",E108)","v":"x"},"x","x","x","x"]
[null,null,"Första paybackår (om något)",{"$f":"MIN(D110:I110)","v":0}]
[null,null,"Paybackår?",{"$f":"IF('-Admin-'!D111=0,\"Ingen payback\",'-Admin-'!D111)","v":"Ingen payback"}]
[]
[]
[null,null,"Omfördelningsnyttor"]
[null,null,"Följande rader används för beräkning av Payback-år",{"$f":"Startår","v":2019},{"$f":"D116+1","v":2020},{"$f":"E116+1","v":2021},{"$f":"F116+1","v":2022},{"$f":"G116+1","v":2023},{"$f":"H116+1","v":2024}]
[null,null,"Ack. diskonterat kassaflöde > 0?",{"$f":"Nyttokalkyl!I123>0","v":false},{"$f":"Nyttokalkyl!J123>0","v":false},{"$f":"Nyttokalkyl!K123>0","v":false},{"$f":"Nyttokalkyl!L123>0","v":false},{"$f":"Nyttokalkyl!M123>0","v":true},{"$f":"Nyttokalkyl!N123>0","v":true}]
[null,null,"Är detta ett paybackår?",{"$f":"IF(D117=FALSE,\"x\",D116)","v":"x"},{"$f":"IF(E117=FALSE,\"x\",E116)","v":"x"},"x","x",{"v":2023,"d":"2,023 "},{"v":2024,"d":"2,024 "}]
[null,null,"Första paybackår (om något)",{"$f":"MIN(D118:I118)","v":{"v":2023,"d":"2,023 "}}]
[null,null,"Paybackår?",{"$f":"IF('-Admin-'!D119=0,\"Ingen payback\",'-Admin-'!D119)","v":2023}]