{"text_format":"3","workbook":"xlsx","n_sheets":7,"sheets":["Försättsblad","Räkna på nyttorna","Nyttor","Kostnader","Nyttokalkyl","Data antal samtal","-Admin-"],"not_rendered":{"charts":15,"macros":1,"defined_names":8,"comments":2,"pivot_tables":9},"read":"whole","date_system":"1900"}

{"sheet":"Försättsblad","index":0,"n_rows":33,"n_cols":6,"rows_kept":33,"merged":[[19,4,20,5]]}
[null,"Försättsblad"]
[null,{"$f":"IF(B6=0,\"\",B6)","v":"Första linjens digitala vård - nya kanaler - video"}]
[]
[]
[null,"Tjänst / projekt / förändringsinitiativ"]
[null,"Första linjens digitala vård - nya kanaler - video"]
[]
[]
[null,"Revisionshistorik"]
[null,"Version","Datum","Författare","Kommentar"]
[null,"0.1","2019-07-01","Amanda Sundberg","Preliminär kalkyl för bild"]
[null,"0.2","2020-09-01","Amanda Sundberg","Uppdaterade bildkalkyl efter effektmätningar i pilot"]
[null,"0.3","2020-12-01","Amanda Sundberg","Uppdaterade bild och video till nationell kalkyl"]
[null,"0.4","2021-02-17","Amanda Sundberg","Lägger ihop bild och video i samma kalkyl, justerar"]
[null,"0.5","2021-03-10","Amanda Sundberg","Justerar andel lämpliga samtal, separerar bild & video"]
[]
[]
[]
[null,"Startår",null,null,"Diskonteringsränta"]
[null,"Från när vill ni börja räkna nyttor och kostnader? ",null,null,"Diskontering innebär att nytta och kostnader som inträffar i framtiden värderas lägre med en viss ränta. Kalkylmallen är förinställd på att räkna med TLVs rekommendation på 3%, men värdet kan ändras nedan. "]
[]
[null,"Parameter","Värde",null,"Parameter","Värde"]
[null,"Startår",2019,null,"Diskonteringsränta",{"v":0.03,"d":"3%"}]
[]
[]
[null,"Intressenter"]
[null,"Ange de intressenter som bär nyttor eller kostnader alternativt är involverade i genomförandet. \nDe intressenter som anges här kommer att visas och bli valbara i den här mallens flikar om kostnader och nyttor. "]
[]
[null,"Intressent"]
[null,"Regioner"]
[null,"Invånare"]
[null,"Inera"]
[null,"Staten"]

{"sheet":"Räkna på nyttorna","index":1,"n_rows":349,"n_cols":18,"rows_kept":349,"merged":[[9,2,17,2],[26,2,34,2],[43,2,51,2],[60,2,68,2],[77,2,85,2],[94,2,102,2],[111,2,119,2],[128,2,136,2],[145,2,153,2],[162,2,170,2],[179,2,187,2],[196,2,204,2],[213,2,221,2],[230,2,238,2],[247,2,255,2],[264,2,272,2],[281,2,289,2],[298,2,306,2],[315,2,323,2],[332,2,340,2],[349,2,357,2]]}
[null,null,"Räkna på nyttorna"]
[null,null,{"$f":"IF(Försättsblad!B6=0,\"\",Försättsblad!B6)","v":"Första linjens digitala vård - nya kanaler - video"}]
[]
[{"$nulls":4},"Skriv en beskrivande rubrik på nyttan. ","Ange ert troligaste värde. ","Ange ett min- och max-värde för att få en osäkerhetsbedömning",null,"Var kommer informationen ifrån? ",null,null,"Fyll i nyttan år för år. Dessa summeras sedan automatiskt. Tänk på att alla nyttor kanske inte infaller från första året. ",{"$nulls":5},"Summeras automatiskt"]
[1,null,"Välj nyttokategori: ",{"$nulls":8},{"$f":"Startår","v":2019},{"$f":"L5+1","v":2020},{"$f":"M5+1","v":2021},2022,2023,2024,"Summa"]
[{"$nulls":10},"Trolig",null,null,{"$f":"N9*$F$19","v":0},{"$f":"O9*$F$19","v":0},0,0,{"$f":"SUM(L6:Q6)","v":0}]
[null,null,"Välj intressent: ",{"$nulls":7},"Min",null,null,{"$f":"N9*$G$19","v":0},{"$f":"O9*$G$19","v":0},0,0,{"$f":"SUM(L7:Q7)","v":0}]
[{"$nulls":10},"Max",null,null,{"$f":"N9*$H$19","v":0},0,0,0,{"$f":"SUM(L8:Q8)","v":0}]
[null,null,"Anteckningar",{"$nulls":10},0.3,0.9,0.9,0.9]
{"$rows_empty":12}
[2,null,"Välj nyttokategori: ",{"$nulls":8},{"$f":"Startår","v":2019},{"$f":"L22+1","v":2020},{"$f":"M22+1","v":2021},{"$f":"N22+1","v":2022},{"$f":"O22+1","v":2023},{"$f":"P22+1","v":2024},"Summa"]
[{"$nulls":10},"Trolig",null,null,{"$f":"N26*$F$36","v":0},{"$f":"O26*$F$36","v":0},0,0,{"$f":"SUM(L23:Q23)","v":0}]
[null,null,"Välj intressent: ",{"$nulls":7},"Min",null,null,{"$f":"N26*$G$36","v":0},{"$f":"O26*$G$36","v":0},0,0,{"$f":"SUM(L24:Q24)","v":0}]
[{"$nulls":10},"Max",null,null,{"$f":"N26*$H$36","v":0},{"$f":"O26*$H$36","v":0},0,0,{"$f":"SUM(L25:Q25)","v":0}]
[null,null,"Anteckningar",{"$nulls":10},0.3,0.9,0.9,0.9]
{"$rows_empty":12}
[3,null,"Välj nyttokategori: ",{"$nulls":8},{"$f":"Startår","v":2019},{"$f":"L39+1","v":2020},{"$f":"M39+1","v":2021},{"$f":"N39+1","v":2022},{"$f":"O39+1","v":2023},{"$f":"P39+1","v":2024},"Summa"]
[{"$nulls":10},"Trolig",null,null,{"$f":"N43*$F$53","v":0},{"$f":"O43*$F$53","v":0},0,0,{"$f":"SUM(L40:Q40)","v":0}]
[null,null,"Välj intressent: ",{"$nulls":7},"Min",null,null,{"$f":"N43*$G$53","v":0},0,0,0,{"$f":"SUM(L41:Q41)","v":0}]
[{"$nulls":10},"Max",null,null,{"$f":"N43*$H$53","v":0},0,0,0,{"$f":"SUM(L42:Q42)","v":0}]
[null,null,"Anteckningar",{"$nulls":10},0.3,0.9,0.9,0.9]
{"$rows_empty":12}
[4,null,"Välj nyttokategori: ",null,"Video - frigjorda vårdbesök","Trolig","Min","Max","Källa ",null,null,{"$f":"Startår","v":2019},{"$f":"L56+1","v":2020},{"$f":"M56+1","v":2021},{"$f":"N56+1","v":2022},{"$f":"O56+1","v":2023},{"$f":"P56+1","v":2024},"Summa"]
[null,null,"2. Omfördelningsnytta",null,"Besvarade invånarsamtal 1177 i snitt för 16 regioner som inför video",{"$f":"'Data antal samtal'!C23","v":{"v":2431777,"d":"2,431,777 "}},{"$f":"F57","v":{"v":2431777,"d":"2,431,777 "}},{"$f":"F57","v":{"v":2431777,"d":"2,431,777 "}},"Baseras på antal besvarade samtal för de 16 regionerna 2019",null,"Trolig",null,null,{"$f":"N60*$F$70","v":{"v":4356042.140099999,"d":"4,356,042 "}},{"$f":"O60*$F$70","v":{"v":13068126.420299996,"d":"13,068,126 "}},{"v":39204379.26089999,"d":"39,204,379 "},{"v":39204379.26089999,"d":"39,204,379 "},{"$f":"SUM(L57:Q57)","v":{"v":95832927.08219998,"d":"95,832,927 "}}]
[null,null,"Välj intressent: ",null,"Andel av samtalen som lämpar sig för video",{"v":0.07,"d":"7%"},{"v":0.05,"d":"5%"},{"v":0.1,"d":"10%"},"Bedömning utifrån piloterna och samtal med medicinskt sakkunnig. ",null,"Min",null,null,{"$f":"N60*$G$70","v":{"v":3111458.6715,"d":"3,111,459 "}},{"$f":"O60*$G$70","v":{"v":9334376.0145,"d":"9,334,376 "}},{"v":28003128.0435,"d":"28,003,128 "},{"v":28003128.0435,"d":"28,003,128 "},{"$f":"SUM(L58:Q58)","v":{"v":68452090.773,"d":"68,452,091 "}}]
[null,null,"Regioner",null,"Antal samtal lämpade för video per år",{"$f":"F58*F57","v":{"v":170224.39,"d":"170,224 "}},{"$f":"G58*G57","v":{"v":121588.85,"d":"121,589 "}},{"v":243177.7,"d":"243,178 "},null,null,"Max",null,null,{"$f":"N60*$H$70","v":{"v":5808056.186799999,"d":"5,808,056 "}},{"$f":"O60*$H$70","v":{"v":17424168.560399998,"d":"17,424,169 "}},{"v":52272505.6812,"d":"52,272,506 "},{"v":52272505.6812,"d":"52,272,506 "},{"$f":"SUM(L59:Q59)","v":{"v":127777236.1096,"d":"127,777,236 "}}]
[null,null,"Anteckningar",null,"Andel röstsamtal - lämpade för video - som får egenvårdsråd",{"v":0.27,"d":"27%"},{"v":0.27,"d":"27%"},{"v":0.39,"d":"39%"},"Resultat från bild- och videopiloter",{"$nulls":4},0.1,0.3,0.9,0.9]
[{"$nulls":4},"Antal röstsamtal - lämpade för video - som får egenvårdsråd",{"$f":"F60*F59","v":{"v":45960.585300000006,"d":"45,961 "}},{"$f":"G60*G59","v":{"v":32828.9895,"d":"32,829 "}},{"v":94839.30300000001,"d":"94,839 "}]
[{"$nulls":4},"Andel videosamtal - lämpade för video -  som får egenvårdsråd",{"v":0.42,"d":"42%"},{"v":0.42,"d":"42%"},{"v":0.53,"d":"53%"},"Resultat från bild- och videopiloter"]
[{"$nulls":4},"Antal videosamtal - lämpade för video -  som får egenvårdsråd",{"$f":"F62*F59","v":{"v":71494.2438,"d":"71,494 "}},{"$f":"G62*G59","v":{"v":51067.317,"d":"51,067 "}},{"v":128884.18100000001,"d":"128,884 "}]
[{"$nulls":4},"Antal besök i primärvården som kan undvikas genom att använda video",{"$f":"F63-F61","v":{"v":25533.65849999999,"d":"25,534 "}},{"$f":"G63-G61","v":{"v":18238.3275,"d":"18,238 "}},{"v":34044.878,"d":"34,045 "}]
[{"$nulls":4},"Regionens kostnad för ett besök i primärvården",{"v":1706,"d":"1,706 "},{"v":1706,"d":"1,706 "},{"v":1706,"d":"1,706 "},"Vården i siffror"]
[]
[]
[]
[]
[{"$nulls":5},{"$f":"F65*F64","v":{"v":43560421.400999986,"d":"43,560,421 "}},{"$f":"G65*G64","v":{"v":31114586.715,"d":"31,114,587 "}},{"v":58080561.86799999,"d":"58,080,562 "}]
[]
[]
[5,null,"Välj nyttokategori: ",null,"Video - sparar tid","Trolig","Min","Max","Källa ",null,null,{"$f":"Startår","v":2019},{"$f":"L73+1","v":2020},{"$f":"M73+1","v":2021},{"$f":"N73+1","v":2022},{"$f":"O73+1","v":2023},{"$f":"P73+1","v":2024},"Summa"]
[null,null,"2. Omfördelningsnytta",null,"Antal besök i primärvården som kan undvikas genom att använda bild",{"$f":"F64","v":{"v":25533.65849999999,"d":"25,534 "}},{"$f":"G64","v":{"v":18238.3275,"d":"18,238 "}},{"v":34044.878,"d":"34,045 "},null,null,"Trolig",null,null,{"$f":"N77*$F$87","v":{"v":653916.9941849998,"d":"653,917 "}},{"$f":"O77*$F$87","v":{"v":1961750.9825549994,"d":"1,961,751 "}},{"v":5885252.9476649985,"d":"5,885,253 "},{"v":5885252.9476649985,"d":"5,885,253 "},{"$f":"SUM(L74:Q74)","v":{"v":14386173.872069996,"d":"14,386,174 "}}]
[null,null,"Välj intressent: ",null,"Snittrestid tur och retur vårdmottagning (timmar)",{"v":0.3,"d":"0.3 "},{"v":0.3,"d":"0.3 "},{"v":0.3,"d":"0.3 "},null,null,"Min",null,null,{"$f":"N77*$G$87","v":{"v":359295.05175000004,"d":"359,295 "}},{"$f":"O77*$G$87","v":{"v":1077885.15525,"d":"1,077,885 "}},{"v":3233655.46575,"d":"3,233,655 "},{"v":3233655.46575,"d":"3,233,655 "},{"$f":"SUM(L75:Q75)","v":{"v":7904491.138499999,"d":"7,904,491 "}}]
[null,null,"Invånare",null,"Snittid på vårdmottagning (timmar)",{"v":1,"d":"1 "},{"v":1,"d":"1 "},{"v":1,"d":"1 "},null,null,"Max",null,null,{"$f":"N77*$H$87","v":{"v":670684.0965999999,"d":"670,684 "}},{"$f":"O77*$H$87","v":{"v":2012052.2897999997,"d":"2,012,052 "}},{"v":6036156.869399999,"d":"6,036,157 "},{"v":6036156.869399999,"d":"6,036,157 "},{"$f":"SUM(L76:Q76)","v":{"v":14755050.1252,"d":"14,755,050 "}}]
[null,null,"Anteckningar",null,"Värdering av tid för vårdbesök för invånaren",{"v":197,"d":"197 "},{"v":197,"d":"197 "},{"v":197,"d":"197 "},{"$nulls":5},0.1,0.3,0.9,0.9]
[{"$nulls":4},"Sparad tid",{"$f":"(F75+F76)*F74*F77","v":{"v":6539169.941849998,"d":"6,539,170 "}},{"$f":"(G75+G76)*G74*G77","v":{"v":4670835.67275,"d":"4,670,836 "}},{"v":8718893.2558,"d":"8,718,893 "}]
{"$rows_empty":8}
[{"$nulls":5},{"$f":"F78","v":{"v":6539169.941849998,"d":"6,539,170 "}},{"$f":"G77*G74","v":{"v":3592950.5175,"d":"3,592,951 "}},{"$f":"H77*H74","v":{"v":6706840.965999999,"d":"6,706,841 "}}]
[]
[]
[6,null,"Välj nyttokategori: ",null,"Video - sparar pengar","Trolig","Min","Max","Källa ",null,null,{"$f":"Startår","v":2019},{"$f":"L90+1","v":2020},{"$f":"M90+1","v":2021},{"$f":"N90+1","v":2022},{"$f":"O90+1","v":2023},{"$f":"P90+1","v":2024},"Summa"]
[null,null,"1. Finansiell",null,{"$f":"E64","v":"Antal besök i primärvården som kan undvikas genom att använda video"},{"$f":"F64","v":{"v":25533.65849999999,"d":"25,534 "}},{"v":18238.3275,"d":"18,238 "},{"v":34044.878,"d":"34,045 "},null,null,"Trolig",null,null,{"$f":"N94*$F$104","v":{"v":497906.3407499998,"d":"497,906 "}},{"$f":"O94*$F$104","v":{"v":1493719.0222499992,"d":"1,493,719 "}},{"v":4481157.066749998,"d":"4,481,157 "},{"v":4481157.066749998,"d":"4,481,157 "},{"$f":"SUM(L91:Q91)","v":{"v":10953939.496499997,"d":"10,953,939 "}}]
[null,null,"Välj intressent: ",null,"Patientavgift för ett besök i primärvården",{"v":195,"d":"195 "},{"v":195,"d":"195 "},{"v":195,"d":"195 "},null,null,"Min",null,null,{"$f":"N94*$G$104","v":{"v":355647.38625,"d":"355,647 "}},{"$f":"O94*$G$104","v":{"v":1066942.15875,"d":"1,066,942 "}},{"v":3200826.47625,"d":"3,200,826 "},{"v":3200826.47625,"d":"3,200,826 "},{"$f":"SUM(L92:Q92)","v":{"v":7824242.4975000005,"d":"7,824,242 "}}]
[null,null,"Invånare",null,"Sparade pengar",{"$f":"F92*F91","v":{"v":4979063.407499998,"d":"4,979,063 "}},{"$f":"G92*G91","v":{"v":3556473.8625,"d":"3,556,474 "}},{"v":6638751.209999999,"d":"6,638,751 "},null,null,"Max",null,null,{"$f":"N94*$H$104","v":{"v":663875.1209999999,"d":"663,875 "}},{"$f":"O94*$H$104","v":{"v":1991625.3629999997,"d":"1,991,625 "}},{"v":5974876.089,"d":"5,974,876 "},{"v":5974876.089,"d":"5,974,876 "},{"$f":"SUM(L93:Q93)","v":{"v":14605252.661999999,"d":"14,605,253 "}}]
[null,null,"Anteckningar",{"$nulls":10},0.1,0.3,0.9,0.9]
{"$rows_empty":9}
[{"$nulls":5},{"$f":"F93","v":{"v":4979063.407499998,"d":"4,979,063 "}},{"$f":"G93","v":{"v":3556473.8625,"d":"3,556,474 "}},{"v":6638751.209999999,"d":"6,638,751 "}]
[]
[]
[7,null,"Välj nyttokategori: ",null,null,"Trolig","Min","Max","Källa ",null,null,{"$f":"Startår","v":2019},{"$f":"L107+1","v":2020},{"$f":"M107+1","v":2021},{"$f":"N107+1","v":2022},{"$f":"O107+1","v":2023},{"$f":"P107+1","v":2024},"Summa"]
[{"$nulls":10},"Trolig",{"$nulls":6},{"$f":"SUM(L108:Q108)","v":0}]
[null,null,"Välj intressent: ",{"$nulls":7},"Min",{"$nulls":6},{"$f":"SUM(L109:Q109)","v":0}]
[{"$nulls":10},"Max",{"$nulls":6},{"$f":"SUM(L110:Q110)","v":0}]
[null,null,"Anteckningar"]
{"$rows_empty":9}
[{"$nulls":5},{"$f":"F114*F112","v":0}]
[]
[]
[8,null,"Välj nyttokategori: ",null,null,"Trolig","Min","Max","Källa ",null,null,{"$f":"Startår","v":2019},{"$f":"L124+1","v":2020},{"$f":"M124+1","v":2021},{"$f":"N124+1","v":2022},{"$f":"O124+1","v":2023},{"$f":"P124+1","v":2024},"Summa"]
[{"$nulls":10},"Trolig",{"$nulls":6},{"$f":"SUM(L125:Q125)","v":0}]
[null,null,"Välj intressent: ",{"$nulls":7},"Min",{"$nulls":6},{"$f":"SUM(L126:Q126)","v":0}]
[{"$nulls":10},"Max",{"$nulls":6},{"$f":"SUM(L127:Q127)","v":0}]
[null,null,"Anteckningar"]
{"$rows_empty":12}
[9,null,"Välj nyttokategori: ",null,null,"Trolig","Min","Max","Källa ",null,null,{"$f":"Startår","v":2019},{"$f":"L141+1","v":2020},{"$f":"M141+1","v":2021},{"$f":"N141+1","v":2022},{"$f":"O141+1","v":2023},{"$f":"P141+1","v":2024},"Summa"]
[{"$nulls":10},"Trolig",{"$nulls":6},{"$f":"SUM(L142:Q142)","v":0}]
[null,null,"Välj intressent: ",{"$nulls":7},"Min",{"$nulls":6},{"$f":"SUM(L143:Q143)","v":0}]
[{"$nulls":10},"Max",{"$nulls":6},{"$f":"SUM(L144:Q144)","v":0}]
[null,null,"Anteckningar"]
{"$rows_empty":12}
[10,null,"Välj nyttokategori: ",null,null,"Trolig","Min","Max","Källa ",null,null,{"$f":"Startår","v":2019},{"$f":"L158+1","v":2020},{"$f":"M158+1","v":2021},{"$f":"N158+1","v":2022},{"$f":"O158+1","v":2023},{"$f":"P158+1","v":2024},"Summa"]
[{"$nulls":10},"Trolig",{"$nulls":6},{"$f":"SUM(L159:Q159)","v":0}]
[null,null,"Välj intressent: ",{"$nulls":7},"Min",{"$nulls":6},{"$f":"SUM(L160:Q160)","v":0}]
[{"$nulls":10},"Max",{"$nulls":6},{"$f":"SUM(L161:Q161)","v":0}]
[null,null,"Anteckningar"]
{"$rows_empty":12}
[11,null,"Välj nyttokategori: ",null,null,"Trolig","Min","Max","Källa ",null,null,{"$f":"Startår","v":2019},{"$f":"L175+1","v":2020},{"$f":"M175+1","v":2021},{"$f":"N175+1","v":2022},{"$f":"O175+1","v":2023},{"$f":"P175+1","v":2024},"Summa"]
[{"$nulls":10},"Trolig",{"$nulls":6},{"$f":"SUM(L176:Q176)","v":0}]
[null,null,"Välj intressent: ",{"$nulls":7},"Min",{"$nulls":6},{"$f":"SUM(L177:Q177)","v":0}]
[{"$nulls":10},"Max",{"$nulls":6},{"$f":"SUM(L178:Q178)","v":0}]
[null,null,"Anteckningar"]
{"$rows_empty":12}
[12,null,"Välj nyttokategori: ",null,null,"Trolig","Min","Max","Källa ",null,null,{"$f":"Startår","v":2019},{"$f":"L192+1","v":2020},{"$f":"M192+1","v":2021},{"$f":"N192+1","v":2022},{"$f":"O192+1","v":2023},{"$f":"P192+1","v":2024},"Summa"]
[{"$nulls":10},"Trolig",{"$nulls":6},{"$f":"SUM(L193:Q193)","v":0}]
[null,null,"Välj intressent: ",{"$nulls":7},"Min",{"$nulls":6},{"$f":"SUM(L194:Q194)","v":0}]
[{"$nulls":10},"Max",{"$nulls":6},{"$f":"SUM(L195:Q195)","v":0}]
[null,null,"Anteckningar"]
{"$rows_empty":12}
[13,null,"Välj nyttokategori: ",null,null,"Trolig","Min","Max","Källa ",null,null,{"$f":"Startår","v":2019},{"$f":"L209+1","v":2020},{"$f":"M209+1","v":2021},{"$f":"N209+1","v":2022},{"$f":"O209+1","v":2023},{"$f":"P209+1","v":2024},"Summa"]
[{"$nulls":10},"Trolig",{"$nulls":6},{"$f":"SUM(L210:Q210)","v":0}]
[null,null,"Välj intressent: ",{"$nulls":7},"Min",{"$nulls":6},{"$f":"SUM(L211:Q211)","v":0}]
[{"$nulls":10},"Max",{"$nulls":6},{"$f":"SUM(L212:Q212)","v":0}]
[null,null,"Anteckningar"]
{"$rows_empty":12}
[14,null,"Välj nyttokategori: ",null,null,"Trolig","Min","Max","Källa ",null,null,{"$f":"Startår","v":2019},{"$f":"L226+1","v":2020},{"$f":"M226+1","v":2021},{"$f":"N226+1","v":2022},{"$f":"O226+1","v":2023},{"$f":"P226+1","v":2024},"Summa"]
[{"$nulls":10},"Trolig",{"$nulls":6},{"$f":"SUM(L227:Q227)","v":0}]
[null,null,"Välj intressent: ",{"$nulls":7},"Min",{"$nulls":6},{"$f":"SUM(L228:Q228)","v":0}]
[{"$nulls":10},"Max",{"$nulls":6},{"$f":"SUM(L229:Q229)","v":0}]
[null,null,"Anteckningar"]
{"$rows_empty":12}
[15,null,"Välj nyttokategori: ",null,null,"Trolig","Min","Max","Källa ",null,null,{"$f":"Startår","v":2019},{"$f":"L243+1","v":2020},{"$f":"M243+1","v":2021},{"$f":"N243+1","v":2022},{"$f":"O243+1","v":2023},{"$f":"P243+1","v":2024},"Summa"]
[{"$nulls":10},"Trolig",{"$nulls":6},{"$f":"SUM(L244:Q244)","v":0}]
[null,null,"Välj intressent: ",{"$nulls":7},"Min",{"$nulls":6},{"$f":"SUM(L245:Q245)","v":0}]
[{"$nulls":10},"Max",{"$nulls":6},{"$f":"SUM(L246:Q246)","v":0}]
[null,null,"Anteckningar"]
{"$rows_empty":12}
[16,null,"Välj nyttokategori: ",null,null,"Trolig","Min","Max","Källa ",null,null,{"$f":"Startår","v":2019},{"$f":"L260+1","v":2020},{"$f":"M260+1","v":2021},{"$f":"N260+1","v":2022},{"$f":"O260+1","v":2023},{"$f":"P260+1","v":2024},"Summa"]
[{"$nulls":10},"Trolig",{"$nulls":6},{"$f":"SUM(L261:Q261)","v":0}]
[null,null,"Välj intressent: ",{"$nulls":7},"Min",{"$nulls":6},{"$f":"SUM(L262:Q262)","v":0}]
[{"$nulls":10},"Max",{"$nulls":6},{"$f":"SUM(L263:Q263)","v":0}]
[null,null,"Anteckningar"]
{"$rows_empty":12}
[17,null,"Välj nyttokategori: ",null,null,"Trolig","Min","Max","Källa ",null,null,{"$f":"Startår","v":2019},{"$f":"L277+1","v":2020},{"$f":"M277+1","v":2021},{"$f":"N277+1","v":2022},{"$f":"O277+1","v":2023},{"$f":"P277+1","v":2024},"Summa"]
[{"$nulls":10},"Trolig",{"$nulls":6},{"$f":"SUM(L278:Q278)","v":0}]
[null,null,"Välj intressent: ",{"$nulls":7},"Min",{"$nulls":6},{"$f":"SUM(L279:Q279)","v":0}]
[{"$nulls":10},"Max",{"$nulls":6},{"$f":"SUM(L280:Q280)","v":0}]
[null,null,"Anteckningar"]
{"$rows_empty":12}
[18,null,"Välj nyttokategori: ",null,null,"Trolig","Min","Max","Källa ",null,null,{"$f":"Startår","v":2019},{"$f":"L294+1","v":2020},{"$f":"M294+1","v":2021},{"$f":"N294+1","v":2022},{"$f":"O294+1","v":2023},{"$f":"P294+1","v":2024},"Summa"]
[{"$nulls":10},"Trolig",{"$nulls":6},{"$f":"SUM(L295:Q295)","v":0}]
[null,null,"Välj intressent: ",{"$nulls":7},"Min",{"$nulls":6},{"$f":"SUM(L296:Q296)","v":0}]
[{"$nulls":10},"Max",{"$nulls":6},{"$f":"SUM(L297:Q297)","v":0}]
[null,null,"Anteckningar"]
{"$rows_empty":12}
[19,null,"Välj nyttokategori: ",null,null,"Trolig","Min","Max","Källa ",null,null,{"$f":"Startår","v":2019},{"$f":"L311+1","v":2020},{"$f":"M311+1","v":2021},{"$f":"N311+1","v":2022},{"$f":"O311+1","v":2023},{"$f":"P311+1","v":2024},"Summa"]
[{"$nulls":10},"Trolig",{"$nulls":6},{"$f":"SUM(L312:Q312)","v":0}]
[null,null,"Välj intressent: ",{"$nulls":7},"Min",{"$nulls":6},{"$f":"SUM(L313:Q313)","v":0}]
[{"$nulls":10},"Max",{"$nulls":6},{"$f":"SUM(L314:Q314)","v":0}]
[null,null,"Anteckningar"]
{"$rows_empty":12}
[20,null,"Välj nyttokategori: ",null,null,"Trolig","Min","Max","Källa ",null,null,{"$f":"Startår","v":2019},{"$f":"L328+1","v":2020},{"$f":"M328+1","v":2021},{"$f":"N328+1","v":2022},{"$f":"O328+1","v":2023},{"$f":"P328+1","v":2024},"Summa"]
[{"$nulls":10},"Trolig",{"$nulls":6},{"$f":"SUM(L329:Q329)","v":0}]
[null,null,"Välj intressent: ",{"$nulls":7},"Min",{"$nulls":6},{"$f":"SUM(L330:Q330)","v":0}]
[{"$nulls":10},"Max",{"$nulls":6},{"$f":"SUM(L331:Q331)","v":0}]
[null,null,"Anteckningar"]
{"$rows_empty":12}
[21,null,"Välj nyttokategori: ",null,null,"Trolig","Min","Max","Källa ",null,null,{"$f":"Startår","v":2019},{"$f":"L345+1","v":2020},{"$f":"M345+1","v":2021},{"$f":"N345+1","v":2022},{"$f":"O345+1","v":2023},{"$f":"P345+1","v":2024},"Summa"]
[{"$nulls":10},"Trolig",{"$nulls":6},{"$f":"SUM(L346:Q346)","v":0}]
[null,null,"Välj intressent: ",{"$nulls":7},"Min",{"$nulls":6},{"$f":"SUM(L347:Q347)","v":0}]
[{"$nulls":10},"Max",{"$nulls":6},{"$f":"SUM(L348:Q348)","v":0}]
[null,null,"Anteckningar"]

{"sheet":"Nyttor","index":2,"n_rows":29,"n_cols":34,"rows_kept":29,"merged":[[0,3,0,5],[3,5,3,10],[3,17,3,24],[3,26,3,33]]}
[null,"Nyttor"]
[null,{"$f":"IF(Försättsblad!B6=0,\"\",Försättsblad!B6)","v":"Första linjens digitala vård - nya kanaler - video"}]
[]
[{"$nulls":5},"Diskontering (justeras under 'Diskonteringsränta' på Försättsbladet)",{"$nulls":11},"Min-värden med diskontering",{"$nulls":8},"Max-värden med diskontering"]
[{"$nulls":5},{"$f":"(1+Diskonteringsränta)^0","v":{"v":1,"d":"1.000 "}},{"$f":"(1+Diskonteringsränta)^1","v":{"v":1.03,"d":"1.030 "}},{"$f":"(1+Diskonteringsränta)^2","v":{"v":1.0609,"d":"1.061 "}},{"$f":"(1+Diskonteringsränta)^3","v":{"v":1.092727,"d":"1.093 "}},{"$f":"(1+Diskonteringsränta)^4","v":{"v":1.12550881,"d":"1.126 "}},{"$f":"(1+Diskonteringsränta)^5","v":{"v":1.1592740742999998,"d":"1.159 "}},{"$nulls":7},{"$f":"F5","v":{"v":1,"d":"1.000 "}},{"$f":"G5","v":{"v":1.03,"d":"1.030 "}},{"v":1.0609,"d":"1.061 "},{"v":1.092727,"d":"1.093 "},{"v":1.12550881,"d":"1.126 "},{"v":1.1592740742999998,"d":"1.159 "},{"$nulls":3},{"$f":"F5","v":{"v":1,"d":"1.000 "}},{"$f":"G5","v":{"v":1.03,"d":"1.030 "}},{"v":1.0609,"d":"1.061 "},{"v":1.092727,"d":"1.093 "},{"v":1.12550881,"d":"1.126 "},{"v":1.1592740742999998,"d":"1.159 "}]
[{"$nulls":5},{"$f":"Startår","v":2019},{"$f":"F6+1","v":2020},{"$f":"G6+1","v":2021},{"$f":"H6+1","v":2022},2023,2024]
[null,"ID","Nyttokategori","Nyttans namn","Intressent ","År 1","År 2","År 3","År 4","År 5","År 6","Summa trolig","Summa min","Summa max","Vägt medel","Osäkerhet",null,"ID","År 1","År 2","År 3","År 4","År 5","År 6","Summa",null,"ID","År 1","År 2","År 3","År 4","År 5","År 6","Summa"]
[null,1,{"$f":"'Räkna på nyttorna'!C6","v":0},{"$f":"'Räkna på nyttorna'!E5","v":0},{"$f":"'Räkna på nyttorna'!C8","v":0},{"$f":"'Räkna på nyttorna'!L6/F5","v":0},{"$f":"'Räkna på nyttorna'!M6/G5","v":0},{"$f":"'Räkna på nyttorna'!N6/H5","v":0},{"$f":"'Räkna på nyttorna'!O6/I5","v":0},{"$f":"'Räkna på nyttorna'!P6/J5","v":0},{"$f":"'Räkna på nyttorna'!Q6/K5","v":0},{"$f":"SUM(Nyttor[[#This Row],[År 1]:[År 6]])","v":0},{"$f":"NyttorMin[[#This Row],[Summa]]","v":0},{"$f":"NyttorMax[[#This Row],[Summa]]","v":0},{"$f":"IF(OR(ISBLANK(N8),ISBLANK(M8),ISBLANK(L8)),\"\",(N8+M8+3*L8)/5)","v":0},{"$f":"IF(OR(ISBLANK(L8),L8=0),\"\",(N8-M8)/5/L8)","v":""},null,{"$f":"B8","v":1},{"$f":"'Räkna på nyttorna'!L7/S5","v":0},{"$f":"'Räkna på nyttorna'!M7/T5","v":0},{"$f":"'Räkna på nyttorna'!N7/U5","v":0},{"$f":"'Räkna på nyttorna'!O7/V5","v":0},{"$f":"'Räkna på nyttorna'!P7/W5","v":0},{"$f":"'Räkna på nyttorna'!Q7/X5","v":0},{"$f":"SUM(NyttorMin[[#This Row],[År 1]:[År 6]])","v":0},null,1,{"$f":"'Räkna på nyttorna'!L8/AB5","v":0},{"$f":"'Räkna på nyttorna'!M8/AC5","v":0},{"$f":"'Räkna på nyttorna'!N8/AD5","v":0},{"$f":"'Räkna på nyttorna'!O8/AE5","v":0},{"$f":"'Räkna på nyttorna'!P8/AF5","v":0},{"$f":"'Räkna på nyttorna'!Q8/AG5","v":0},{"$f":"SUM(NyttorMax[[#This Row],[År 1]:[År 6]])","v":0}]
[null,2,{"$f":"'Räkna på nyttorna'!C23","v":0},{"$f":"'Räkna på nyttorna'!E22","v":0},{"$f":"'Räkna på nyttorna'!C25","v":0},{"$f":"'Räkna på nyttorna'!L23/F5","v":0},{"$f":"'Räkna på nyttorna'!M23/G5","v":0},{"$f":"'Räkna på nyttorna'!N23/H5","v":0},{"$f":"'Räkna på nyttorna'!O23/I5","v":0},{"$f":"'Räkna på nyttorna'!P23/J5","v":0},{"$f":"'Räkna på nyttorna'!Q23/K5","v":0},{"$f":"SUM(Nyttor[[#This Row],[År 1]:[År 6]])","v":0},{"$f":"NyttorMin[[#This Row],[Summa]]","v":0},{"$f":"NyttorMax[[#This Row],[Summa]]","v":0},0,"",null,2,{"$f":"'Räkna på nyttorna'!L24/S5","v":0},{"$f":"'Räkna på nyttorna'!M24/T5","v":0},{"$f":"'Räkna på nyttorna'!N24/U5","v":0},{"$f":"'Räkna på nyttorna'!O24/V5","v":0},{"$f":"'Räkna på nyttorna'!P24/W5","v":0},{"$f":"'Räkna på nyttorna'!Q24/X5","v":0},{"$f":"SUM(NyttorMin[[#This Row],[År 1]:[År 6]])","v":0},null,2,{"$f":"'Räkna på nyttorna'!L25/AB5","v":0},{"$f":"'Räkna på nyttorna'!M25/AC5","v":0},{"$f":"'Räkna på nyttorna'!N25/AD5","v":0},{"$f":"'Räkna på nyttorna'!O25/AE5","v":0},{"$f":"'Räkna på nyttorna'!P25/AF5","v":0},{"$f":"'Räkna på nyttorna'!Q25/AG5","v":0},{"$f":"SUM(NyttorMax[[#This Row],[År 1]:[År 6]])","v":0}]
[null,3,{"$f":"'Räkna på nyttorna'!C40","v":0},{"$f":"'Räkna på nyttorna'!E39","v":0},"Invånare",{"$f":"'Räkna på nyttorna'!L40/F5","v":0},{"$f":"'Räkna på nyttorna'!M40/G5","v":0},{"$f":"'Räkna på nyttorna'!N40/H5","v":0},{"$f":"'Räkna på nyttorna'!O40/I5","v":0},{"$f":"'Räkna på nyttorna'!P40/J5","v":0},{"$f":"'Räkna på nyttorna'!Q40/K5","v":0},{"$f":"SUM(Nyttor[[#This Row],[År 1]:[År 6]])","v":0},{"$f":"NyttorMin[[#This Row],[Summa]]","v":0},{"$f":"NyttorMax[[#This Row],[Summa]]","v":0},0,"",null,3,{"$f":"'Räkna på nyttorna'!L41/S5","v":0},{"$f":"'Räkna på nyttorna'!M41/T5","v":0},{"$f":"'Räkna på nyttorna'!N41/U5","v":0},{"$f":"'Räkna på nyttorna'!O41/V5","v":0},{"$f":"'Räkna på nyttorna'!P41/W5","v":0},{"$f":"'Räkna på nyttorna'!Q41/X5","v":0},{"$f":"SUM(NyttorMin[[#This Row],[År 1]:[År 6]])","v":0},null,3,{"$f":"'Räkna på nyttorna'!L42/AB5","v":0},{"$f":"'Räkna på nyttorna'!M42/AC5","v":0},{"$f":"'Räkna på nyttorna'!N42/AD5","v":0},{"$f":"'Räkna på nyttorna'!O42/AE5","v":0},{"$f":"'Räkna på nyttorna'!P42/AF5","v":0},{"$f":"'Räkna på nyttorna'!Q42/AG5","v":0},{"$f":"SUM(NyttorMax[[#This Row],[År 1]:[År 6]])","v":0}]
[null,4,{"$f":"'Räkna på nyttorna'!C57","v":"2. Omfördelningsnytta"},{"$f":"'Räkna på nyttorna'!E56","v":"Video - frigjorda vårdbesök"},{"$f":"'Räkna på nyttorna'!C59","v":"Regioner"},{"$f":"'Räkna på nyttorna'!L57/F5","v":0},{"$f":"'Räkna på nyttorna'!M57/G5","v":0},{"$f":"'Räkna på nyttorna'!N57/H5","v":{"v":4105987.5012725033,"d":"4,105,988 "}},{"$f":"'Räkna på nyttorna'!O57/I5","v":{"v":11959186.896910204,"d":"11,959,187 "}},{"$f":"'Räkna på nyttorna'!P57/J5","v":{"v":34832583.19488409,"d":"34,832,583 "}},{"$f":"'Räkna på nyttorna'!Q57/K5","v":{"v":33818041.936780676,"d":"33,818,042 "}},{"$f":"SUM(Nyttor[[#This Row],[År 1]:[År 6]])","v":{"v":84715799.52984747,"d":"84,715,800 "}},{"$f":"NyttorMin[[#This Row],[Summa]]","v":{"v":60511285.37846249,"d":"60,511,285 "}},{"$f":"NyttorMax[[#This Row],[Summa]]","v":{"v":112954399.37313,"d":"112,954,399 "}},{"v":85522616.66822699,"d":"85,522,617 "},{"v":0.12380952380952386,"d":"12%"},null,4,{"$f":"'Räkna på nyttorna'!L58/S5","v":0},{"$f":"'Räkna på nyttorna'!M58/T5","v":0},{"$f":"'Räkna på nyttorna'!N58/U5","v":{"v":2932848.2151946463,"d":"2,932,848 "}},{"$f":"'Räkna på nyttorna'!O58/V5","v":{"v":8542276.354935862,"d":"8,542,276 "}},{"$f":"'Räkna på nyttorna'!P58/W5","v":{"v":24880416.567774355,"d":"24,880,417 "}},{"$f":"'Räkna på nyttorna'!Q58/X5","v":{"v":24155744.24055763,"d":"24,155,744 "}},{"$f":"SUM(NyttorMin[[#This Row],[År 1]:[År 6]])","v":{"v":60511285.37846249,"d":"60,511,285 "}},null,4,{"$f":"'Räkna på nyttorna'!L59/AB5","v":0},{"$f":"'Räkna på nyttorna'!M59/AC5","v":0},{"$f":"'Räkna på nyttorna'!N59/AD5","v":{"v":5474650.001696672,"d":"5,474,650 "}},{"$f":"'Räkna på nyttorna'!O59/AE5","v":{"v":15945582.529213607,"d":"15,945,583 "}},{"$f":"'Räkna på nyttorna'!P59/AF5","v":{"v":46443444.259845465,"d":"46,443,444 "}},{"$f":"'Räkna på nyttorna'!Q59/AG5","v":{"v":45090722.582374245,"d":"45,090,723 "}},{"$f":"SUM(NyttorMax[[#This Row],[År 1]:[År 6]])","v":{"v":112954399.37313,"d":"112,954,399 "}}]
[null,5,{"$f":"'Räkna på nyttorna'!C74","v":"2. Omfördelningsnytta"},{"$f":"'Räkna på nyttorna'!E73","v":"Video - sparar tid"},{"$f":"'Räkna på nyttorna'!C76","v":"Invånare"},{"$f":"'Räkna på nyttorna'!L74/F5","v":0},{"$f":"'Räkna på nyttorna'!M74/G5","v":0},{"$f":"'Räkna på nyttorna'!N74/H5","v":{"v":616379.4836318219,"d":"616,379 "}},{"$f":"'Räkna på nyttorna'!O74/I5","v":{"v":1795280.0494130733,"d":"1,795,280 "}},{"$f":"'Räkna på nyttorna'!P74/J5","v":{"v":5228971.017707981,"d":"5,228,971 "}},{"$f":"'Räkna på nyttorna'!Q74/K5","v":{"v":5076670.890978623,"d":"5,076,671 "}},{"$f":"SUM(Nyttor[[#This Row],[År 1]:[År 6]])","v":{"v":12717301.4417315,"d":"12,717,301 "}},{"$f":"NyttorMin[[#This Row],[Summa]]","v":{"v":6987528.264687639,"d":"6,987,528 "}},{"$f":"NyttorMax[[#This Row],[Summa]]","v":{"v":13043386.09408359,"d":"13,043,386 "}},{"v":11636563.736793146,"d":"11,636,564 "},{"v":0.09523809523809523,"d":"10%"},null,5,{"$f":"'Räkna på nyttorna'!L75/S5","v":0},{"$f":"'Räkna på nyttorna'!M75/T5","v":0},{"$f":"'Räkna på nyttorna'!N75/U5","v":{"v":338670.04595155065,"d":"338,670 "}},{"$f":"'Räkna på nyttorna'!O75/V5","v":{"v":986417.6095676231,"d":"986,418 "}},{"$f":"'Räkna på nyttorna'!P75/W5","v":{"v":2873060.99874065,"d":"2,873,061 "}},{"$f":"'Räkna på nyttorna'!Q75/X5","v":{"v":2789379.6104278155,"d":"2,789,380 "}},{"$f":"SUM(NyttorMin[[#This Row],[År 1]:[År 6]])","v":{"v":6987528.264687639,"d":"6,987,528 "}},null,5,{"$f":"'Räkna på nyttorna'!L76/AB5","v":0},{"$f":"'Räkna på nyttorna'!M76/AC5","v":0},{"$f":"'Räkna på nyttorna'!N76/AD5","v":{"v":632184.0857762276,"d":"632,184 "}},{"$f":"'Räkna på nyttorna'!O76/AE5","v":{"v":1841312.871192896,"d":"1,841,313 "}},{"$f":"'Räkna på nyttorna'!P76/AF5","v":{"v":5363047.197649213,"d":"5,363,047 "}},{"$f":"'Räkna på nyttorna'!Q76/AG5","v":{"v":5206841.939465255,"d":"5,206,842 "}},{"$f":"SUM(NyttorMax[[#This Row],[År 1]:[År 6]])","v":{"v":13043386.09408359,"d":"13,043,386 "}}]
[null,6,{"$f":"'Räkna på nyttorna'!C91","v":"1. Finansiell"},{"$f":"'Räkna på nyttorna'!E90","v":"Video - sparar pengar"},{"$f":"'Räkna på nyttorna'!C93","v":"Invånare"},{"$f":"'Räkna på nyttorna'!L91/F5","v":0},{"$f":"'Räkna på nyttorna'!M91/G5","v":0},{"$f":"'Räkna på nyttorna'!N91/H5","v":{"v":469324.47992270696,"d":"469,324 "}},{"$f":"'Räkna på nyttorna'!O91/I5","v":{"v":1366964.5046292434,"d":"1,366,965 "}},{"$f":"'Räkna på nyttorna'!P91/J5","v":{"v":3981450.013483234,"d":"3,981,450 "}},{"$f":"'Räkna på nyttorna'!Q91/K5","v":{"v":3865485.4499837225,"d":"3,865,485 "}},{"$f":"SUM(Nyttor[[#This Row],[År 1]:[År 6]])","v":{"v":9683224.448018909,"d":"9,683,224 "}},{"$f":"NyttorMin[[#This Row],[Summa]]","v":{"v":6916588.891442079,"d":"6,916,589 "}},{"$f":"NyttorMax[[#This Row],[Summa]]","v":{"v":12910965.93069188,"d":"12,910,966 "}},{"v":9775445.633238137,"d":"9,775,446 "},{"v":0.1238095238095238,"d":"12%"},null,6,{"$f":"'Räkna på nyttorna'!L92/S5","v":0},{"$f":"'Räkna på nyttorna'!M92/T5","v":0},{"$f":"'Räkna på nyttorna'!N92/U5","v":{"v":335231.7713733622,"d":"335,232 "}},{"$f":"'Räkna på nyttorna'!O92/V5","v":{"v":976403.2175923171,"d":"976,403 "}},{"$f":"'Räkna på nyttorna'!P92/W5","v":{"v":2843892.8667737395,"d":"2,843,893 "}},{"$f":"'Räkna på nyttorna'!Q92/X5","v":{"v":2761061.0357026597,"d":"2,761,061 "}},{"$f":"SUM(NyttorMin[[#This Row],[År 1]:[År 6]])","v":{"v":6916588.891442079,"d":"6,916,589 "}},null,6,{"$f":"'Räkna på nyttorna'!L93/AB5","v":0},{"$f":"'Räkna på nyttorna'!M93/AC5","v":0},{"$f":"'Räkna på nyttorna'!N93/AD5","v":{"v":625765.9732302761,"d":"625,766 "}},{"$f":"'Räkna på nyttorna'!O93/AE5","v":{"v":1822619.3395056585,"d":"1,822,619 "}},{"$f":"'Räkna på nyttorna'!P93/AF5","v":{"v":5308600.0179776475,"d":"5,308,600 "}},{"$f":"'Räkna på nyttorna'!Q93/AG5","v":{"v":5153980.599978298,"d":"5,153,981 "}},{"$f":"SUM(NyttorMax[[#This Row],[År 1]:[År 6]])","v":{"v":12910965.93069188,"d":"12,910,966 "}}]
[null,7,{"$f":"'Räkna på nyttorna'!C108","v":0},{"$f":"'Räkna på nyttorna'!E107","v":0},{"$f":"'Räkna på nyttorna'!C110","v":0},{"$f":"'Räkna på nyttorna'!L108/F5","v":0},{"$f":"'Räkna på nyttorna'!M108/G5","v":0},{"$f":"'Räkna på nyttorna'!N108/H5","v":0},{"$f":"'Räkna på nyttorna'!O108/I5","v":0},{"$f":"'Räkna på nyttorna'!P108/J5","v":0},{"$f":"'Räkna på nyttorna'!Q108/K5","v":0},{"$f":"SUM(Nyttor[[#This Row],[År 1]:[År 6]])","v":0},{"$f":"NyttorMin[[#This Row],[Summa]]","v":0},{"$f":"NyttorMax[[#This Row],[Summa]]","v":0},0,"",null,7,{"$f":"'Räkna på nyttorna'!L109/S5","v":0},{"$f":"'Räkna på nyttorna'!M109/T5","v":0},{"$f":"'Räkna på nyttorna'!N109/U5","v":0},{"$f":"'Räkna på nyttorna'!O109/V5","v":0},{"$f":"'Räkna på nyttorna'!P109/W5","v":0},{"$f":"'Räkna på nyttorna'!Q109/X5","v":0},{"$f":"SUM(NyttorMin[[#This Row],[År 1]:[År 6]])","v":0},null,7,{"$f":"'Räkna på nyttorna'!L110/AB5","v":0},{"$f":"'Räkna på nyttorna'!M110/AC5","v":0},{"$f":"'Räkna på nyttorna'!N110/AD5","v":0},{"$f":"'Räkna på nyttorna'!O110/AE5","v":0},{"$f":"'Räkna på nyttorna'!P110/AF5","v":0},{"$f":"'Räkna på nyttorna'!Q110/AG5","v":0},{"$f":"SUM(NyttorMax[[#This Row],[År 1]:[År 6]])","v":0}]
[null,8,{"$f":"'Räkna på nyttorna'!C125","v":0},{"$f":"'Räkna på nyttorna'!E124","v":0},{"$f":"'Räkna på nyttorna'!C127","v":0},{"$f":"'Räkna på nyttorna'!L125/F5","v":0},{"$f":"'Räkna på nyttorna'!M125/G5","v":0},{"$f":"'Räkna på nyttorna'!N125/H5","v":0},{"$f":"'Räkna på nyttorna'!O125/I5","v":0},{"$f":"'Räkna på nyttorna'!P125/J5","v":0},{"$f":"'Räkna på nyttorna'!Q125/K5","v":0},{"$f":"SUM(Nyttor[[#This Row],[År 1]:[År 6]])","v":0},{"$f":"NyttorMin[[#This Row],[Summa]]","v":0},{"$f":"NyttorMax[[#This Row],[Summa]]","v":0},0,"",null,8,{"$f":"'Räkna på nyttorna'!L126/S5","v":0},{"$f":"'Räkna på nyttorna'!M126/T5","v":0},{"$f":"'Räkna på nyttorna'!N126/U5","v":0},{"$f":"'Räkna på nyttorna'!O126/V5","v":0},{"$f":"'Räkna på nyttorna'!P126/W5","v":0},{"$f":"'Räkna på nyttorna'!Q126/X5","v":0},{"$f":"SUM(NyttorMin[[#This Row],[År 1]:[År 6]])","v":0},null,8,{"$f":"'Räkna på nyttorna'!L127/AB5","v":0},{"$f":"'Räkna på nyttorna'!M127/AC5","v":0},{"$f":"'Räkna på nyttorna'!N127/AD5","v":0},{"$f":"'Räkna på nyttorna'!O127/AE5","v":0},{"$f":"'Räkna på nyttorna'!P127/AF5","v":0},{"$f":"'Räkna på nyttorna'!Q127/AG5","v":0},{"$f":"SUM(NyttorMax[[#This Row],[År 1]:[År 6]])","v":0}]
[null,9,{"$f":"'Räkna på nyttorna'!C142","v":0},{"$f":"'Räkna på nyttorna'!E141","v":0},{"$f":"'Räkna på nyttorna'!C144","v":0},{"$f":"'Räkna på nyttorna'!L142/F5","v":0},{"$f":"'Räkna på nyttorna'!M142/G5","v":0},{"$f":"'Räkna på nyttorna'!N142/H5","v":0},{"$f":"'Räkna på nyttorna'!O142/I5","v":0},{"$f":"'Räkna på nyttorna'!P142/J5","v":0},{"$f":"'Räkna på nyttorna'!Q142/K5","v":0},{"$f":"SUM(Nyttor[[#This Row],[År 1]:[År 6]])","v":0},{"$f":"NyttorMin[[#This Row],[Summa]]","v":0},{"$f":"NyttorMax[[#This Row],[Summa]]","v":0},0,"",null,9,{"$f":"'Räkna på nyttorna'!L143/S5","v":0},{"$f":"'Räkna på nyttorna'!M143/T5","v":0},{"$f":"'Räkna på nyttorna'!N143/U5","v":0},{"$f":"'Räkna på nyttorna'!O143/V5","v":0},{"$f":"'Räkna på nyttorna'!P143/W5","v":0},{"$f":"'Räkna på nyttorna'!Q143/X5","v":0},{"$f":"SUM(NyttorMin[[#This Row],[År 1]:[År 6]])","v":0},null,9,{"$f":"'Räkna på nyttorna'!L144/AB5","v":0},{"$f":"'Räkna på nyttorna'!M144/AC5","v":0},{"$f":"'Räkna på nyttorna'!N144/AD5","v":0},{"$f":"'Räkna på nyttorna'!O144/AE5","v":0},{"$f":"'Räkna på nyttorna'!P144/AF5","v":0},{"$f":"'Räkna på nyttorna'!Q144/AG5","v":0},{"$f":"SUM(NyttorMax[[#This Row],[År 1]:[År 6]])","v":0}]
[null,10,{"$f":"'Räkna på nyttorna'!C159","v":0},{"$f":"'Räkna på nyttorna'!E158","v":0},{"$f":"'Räkna på nyttorna'!C161","v":0},{"$f":"'Räkna på nyttorna'!L159/F5","v":0},{"$f":"'Räkna på nyttorna'!M159/G5","v":0},{"$f":"'Räkna på nyttorna'!N159/H5","v":0},{"$f":"'Räkna på nyttorna'!O159/I5","v":0},{"$f":"'Räkna på nyttorna'!P159/J5","v":0},{"$f":"'Räkna på nyttorna'!Q159/K5","v":0},{"$f":"SUM(Nyttor[[#This Row],[År 1]:[År 6]])","v":0},{"$f":"NyttorMin[[#This Row],[Summa]]","v":0},{"$f":"NyttorMax[[#This Row],[Summa]]","v":0},0,"",null,10,{"$f":"'Räkna på nyttorna'!L160/S5","v":0},{"$f":"'Räkna på nyttorna'!M160/T5","v":0},{"$f":"'Räkna på nyttorna'!N160/U5","v":0},{"$f":"'Räkna på nyttorna'!O160/V5","v":0},{"$f":"'Räkna på nyttorna'!P160/W5","v":0},{"$f":"'Räkna på nyttorna'!Q160/X5","v":0},{"$f":"SUM(NyttorMin[[#This Row],[År 1]:[År 6]])","v":0},null,10,{"$f":"'Räkna på nyttorna'!L161/AB5","v":0},{"$f":"'Räkna på nyttorna'!M161/AC5","v":0},{"$f":"'Räkna på nyttorna'!N161/AD5","v":0},{"$f":"'Räkna på nyttorna'!O161/AE5","v":0},{"$f":"'Räkna på nyttorna'!P161/AF5","v":0},{"$f":"'Räkna på nyttorna'!Q161/AG5","v":0},{"$f":"SUM(NyttorMax[[#This Row],[År 1]:[År 6]])","v":0}]
[null,11,{"$f":"'Räkna på nyttorna'!C176","v":0},{"$f":"'Räkna på nyttorna'!E175","v":0},{"$f":"'Räkna på nyttorna'!C178","v":0},{"$f":"'Räkna på nyttorna'!L176/F5","v":0},{"$f":"'Räkna på nyttorna'!M176/G5","v":0},{"$f":"'Räkna på nyttorna'!N176/H5","v":0},{"$f":"'Räkna på nyttorna'!O176/I5","v":0},{"$f":"'Räkna på nyttorna'!P176/J5","v":0},{"$f":"'Räkna på nyttorna'!Q176/K5","v":0},{"$f":"SUM(Nyttor[[#This Row],[År 1]:[År 6]])","v":0},{"$f":"NyttorMin[[#This Row],[Summa]]","v":0},{"$f":"NyttorMax[[#This Row],[Summa]]","v":0},0,"",null,11,{"$f":"'Räkna på nyttorna'!L177/S5","v":0},{"$f":"'Räkna på nyttorna'!M177/T5","v":0},{"$f":"'Räkna på nyttorna'!N177/U5","v":0},{"$f":"'Räkna på nyttorna'!O177/V5","v":0},{"$f":"'Räkna på nyttorna'!P177/W5","v":0},{"$f":"'Räkna på nyttorna'!Q177/X5","v":0},{"$f":"SUM(NyttorMin[[#This Row],[År 1]:[År 6]])","v":0},null,11,{"$f":"'Räkna på nyttorna'!L178/AB5","v":0},{"$f":"'Räkna på nyttorna'!M178/AC5","v":0},{"$f":"'Räkna på nyttorna'!N178/AD5","v":0},{"$f":"'Räkna på nyttorna'!O178/AE5","v":0},{"$f":"'Räkna på nyttorna'!P178/AF5","v":0},{"$f":"'Räkna på nyttorna'!Q178/AG5","v":0},{"$f":"SUM(NyttorMax[[#This Row],[År 1]:[År 6]])","v":0}]
[null,12,{"$f":"'Räkna på nyttorna'!C193","v":0},{"$f":"'Räkna på nyttorna'!E192","v":0},{"$f":"'Räkna på nyttorna'!C195","v":0},{"$f":"'Räkna på nyttorna'!L193/F5","v":0},{"$f":"'Räkna på nyttorna'!M193/G5","v":0},{"$f":"'Räkna på nyttorna'!N193/H5","v":0},{"$f":"'Räkna på nyttorna'!O193/I5","v":0},{"$f":"'Räkna på nyttorna'!P193/J5","v":0},{"$f":"'Räkna på nyttorna'!Q193/K5","v":0},{"$f":"SUM(Nyttor[[#This Row],[År 1]:[År 6]])","v":0},{"$f":"NyttorMin[[#This Row],[Summa]]","v":0},{"$f":"NyttorMax[[#This Row],[Summa]]","v":0},0,"",null,12,{"$f":"'Räkna på nyttorna'!L194/S5","v":0},{"$f":"'Räkna på nyttorna'!M194/T5","v":0},{"$f":"'Räkna på nyttorna'!N194/U5","v":0},{"$f":"'Räkna på nyttorna'!O194/V5","v":0},{"$f":"'Räkna på nyttorna'!P194/W5","v":0},{"$f":"'Räkna på nyttorna'!Q194/X5","v":0},{"$f":"SUM(NyttorMin[[#This Row],[År 1]:[År 6]])","v":0},null,12,{"$f":"'Räkna på nyttorna'!L195/AB5","v":0},{"$f":"'Räkna på nyttorna'!M195/AC5","v":0},{"$f":"'Räkna på nyttorna'!N195/AD5","v":0},{"$f":"'Räkna på nyttorna'!O195/AE5","v":0},{"$f":"'Räkna på nyttorna'!P195/AF5","v":0},{"$f":"'Räkna på nyttorna'!Q195/AG5","v":0},{"$f":"SUM(NyttorMax[[#This Row],[År 1]:[År 6]])","v":0}]
[null,13,{"$f":"'Räkna på nyttorna'!C210","v":0},{"$f":"'Räkna på nyttorna'!E209","v":0},{"$f":"'Räkna på nyttorna'!C212","v":0},{"$f":"'Räkna på nyttorna'!L210/F5","v":0},{"$f":"'Räkna på nyttorna'!M210/G5","v":0},{"$f":"'Räkna på nyttorna'!N210/H5","v":0},{"$f":"'Räkna på nyttorna'!O210/I5","v":0},{"$f":"'Räkna på nyttorna'!P210/J5","v":0},{"$f":"'Räkna på nyttorna'!Q210/K5","v":0},{"$f":"SUM(Nyttor[[#This Row],[År 1]:[År 6]])","v":0},{"$f":"NyttorMin[[#This Row],[Summa]]","v":0},{"$f":"NyttorMax[[#This Row],[Summa]]","v":0},0,"",null,13,{"$f":"'Räkna på nyttorna'!L211/S5","v":0},{"$f":"'Räkna på nyttorna'!M211/T5","v":0},{"$f":"'Räkna på nyttorna'!N211/U5","v":0},{"$f":"'Räkna på nyttorna'!O211/V5","v":0},{"$f":"'Räkna på nyttorna'!P211/W5","v":0},{"$f":"'Räkna på nyttorna'!Q211/X5","v":0},{"$f":"SUM(NyttorMin[[#This Row],[År 1]:[År 6]])","v":0},null,13,{"$f":"'Räkna på nyttorna'!L212/AB5","v":0},{"$f":"'Räkna på nyttorna'!M212/AC5","v":0},{"$f":"'Räkna på nyttorna'!N212/AD5","v":0},{"$f":"'Räkna på nyttorna'!O212/AE5","v":0},{"$f":"'Räkna på nyttorna'!P212/AF5","v":0},{"$f":"'Räkna på nyttorna'!Q212/AG5","v":0},{"$f":"SUM(NyttorMax[[#This Row],[År 1]:[År 6]])","v":0}]
[null,14,{"$f":"'Räkna på nyttorna'!C227","v":0},{"$f":"'Räkna på nyttorna'!E226","v":0},{"$f":"'Räkna på nyttorna'!C229","v":0},{"$f":"'Räkna på nyttorna'!L227/F5","v":0},{"$f":"'Räkna på nyttorna'!M227/G5","v":0},{"$f":"'Räkna på nyttorna'!N227/H5","v":0},{"$f":"'Räkna på nyttorna'!O227/I5","v":0},{"$f":"'Räkna på nyttorna'!P227/J5","v":0},{"$f":"'Räkna på nyttorna'!Q227/K5","v":0},{"$f":"SUM(Nyttor[[#This Row],[År 1]:[År 6]])","v":0},{"$f":"NyttorMin[[#This Row],[Summa]]","v":0},{"$f":"NyttorMax[[#This Row],[Summa]]","v":0},0,"",null,14,{"$f":"'Räkna på nyttorna'!L228/S5","v":0},{"$f":"'Räkna på nyttorna'!M228/T5","v":0},{"$f":"'Räkna på nyttorna'!N228/U5","v":0},{"$f":"'Räkna på nyttorna'!O228/V5","v":0},{"$f":"'Räkna på nyttorna'!P228/W5","v":0},{"$f":"'Räkna på nyttorna'!Q228/X5","v":0},{"$f":"SUM(NyttorMin[[#This Row],[År 1]:[År 6]])","v":0},null,14,{"$f":"'Räkna på nyttorna'!L229/AB5","v":0},{"$f":"'Räkna på nyttorna'!M229/AC5","v":0},{"$f":"'Räkna på nyttorna'!N229/AD5","v":0},{"$f":"'Räkna på nyttorna'!O229/AE5","v":0},{"$f":"'Räkna på nyttorna'!P229/AF5","v":0},{"$f":"'Räkna på nyttorna'!Q229/AG5","v":0},{"$f":"SUM(NyttorMax[[#This Row],[År 1]:[År 6]])","v":0}]
[null,15,{"$f":"'Räkna på nyttorna'!C244","v":0},{"$f":"'Räkna på nyttorna'!E243","v":0},{"$f":"'Räkna på nyttorna'!C246","v":0},{"$f":"'Räkna på nyttorna'!L244/F5","v":0},{"$f":"'Räkna på nyttorna'!M244/G5","v":0},{"$f":"'Räkna på nyttorna'!N244/H5","v":0},{"$f":"'Räkna på nyttorna'!O244/I5","v":0},{"$f":"'Räkna på nyttorna'!P244/J5","v":0},{"$f":"'Räkna på nyttorna'!Q244/K5","v":0},{"$f":"SUM(Nyttor[[#This Row],[År 1]:[År 6]])","v":0},{"$f":"NyttorMin[[#This Row],[Summa]]","v":0},{"$f":"NyttorMax[[#This Row],[Summa]]","v":0},0,"",null,15,{"$f":"'Räkna på nyttorna'!L245/S5","v":0},{"$f":"'Räkna på nyttorna'!M245/T5","v":0},{"$f":"'Räkna på nyttorna'!N245/U5","v":0},{"$f":"'Räkna på nyttorna'!O245/V5","v":0},{"$f":"'Räkna på nyttorna'!P245/W5","v":0},{"$f":"'Räkna på nyttorna'!Q245/X5","v":0},{"$f":"SUM(NyttorMin[[#This Row],[År 1]:[År 6]])","v":0},null,15,{"$f":"'Räkna på nyttorna'!L246/AB5","v":0},{"$f":"'Räkna på nyttorna'!M246/AC5","v":0},{"$f":"'Räkna på nyttorna'!N246/AD5","v":0},{"$f":"'Räkna på nyttorna'!O246/AE5","v":0},{"$f":"'Räkna på nyttorna'!P246/AF5","v":0},{"$f":"'Räkna på nyttorna'!Q246/AG5","v":0},{"$f":"SUM(NyttorMax[[#This Row],[År 1]:[År 6]])","v":0}]
[null,16,{"$f":"'Räkna på nyttorna'!C261","v":0},{"$f":"'Räkna på nyttorna'!E260","v":0},{"$f":"'Räkna på nyttorna'!C263","v":0},{"$f":"'Räkna på nyttorna'!L261/F5","v":0},{"$f":"'Räkna på nyttorna'!M261/G5","v":0},{"$f":"'Räkna på nyttorna'!N261/H5","v":0},{"$f":"'Räkna på nyttorna'!O261/I5","v":0},{"$f":"'Räkna på nyttorna'!P261/J5","v":0},{"$f":"'Räkna på nyttorna'!Q261/K5","v":0},{"$f":"SUM(Nyttor[[#This Row],[År 1]:[År 6]])","v":0},{"$f":"NyttorMin[[#This Row],[Summa]]","v":0},{"$f":"NyttorMax[[#This Row],[Summa]]","v":0},0,"",null,16,{"$f":"'Räkna på nyttorna'!L262/S5","v":0},{"$f":"'Räkna på nyttorna'!M262/T5","v":0},{"$f":"'Räkna på nyttorna'!N262/U5","v":0},{"$f":"'Räkna på nyttorna'!O262/V5","v":0},{"$f":"'Räkna på nyttorna'!P262/W5","v":0},{"$f":"'Räkna på nyttorna'!Q262/X5","v":0},{"$f":"SUM(NyttorMin[[#This Row],[År 1]:[År 6]])","v":0},null,16,{"$f":"'Räkna på nyttorna'!L263/AB5","v":0},{"$f":"'Räkna på nyttorna'!M263/AC5","v":0},{"$f":"'Räkna på nyttorna'!N263/AD5","v":0},{"$f":"'Räkna på nyttorna'!O263/AE5","v":0},{"$f":"'Räkna på nyttorna'!P263/AF5","v":0},{"$f":"'Räkna på nyttorna'!Q263/AG5","v":0},{"$f":"SUM(NyttorMax[[#This Row],[År 1]:[År 6]])","v":0}]
[null,17,{"$f":"'Räkna på nyttorna'!C278","v":0},{"$f":"'Räkna på nyttorna'!E277","v":0},{"$f":"'Räkna på nyttorna'!C280","v":0},{"$f":"'Räkna på nyttorna'!L278/F5","v":0},{"$f":"'Räkna på nyttorna'!M278/G5","v":0},{"$f":"'Räkna på nyttorna'!N278/H5","v":0},{"$f":"'Räkna på nyttorna'!O278/I5","v":0},{"$f":"'Räkna på nyttorna'!P278/J5","v":0},{"$f":"'Räkna på nyttorna'!Q278/K5","v":0},{"$f":"SUM(Nyttor[[#This Row],[År 1]:[År 6]])","v":0},{"$f":"NyttorMin[[#This Row],[Summa]]","v":0},{"$f":"NyttorMax[[#This Row],[Summa]]","v":0},0,"",null,17,{"$f":"'Räkna på nyttorna'!L279/S5","v":0},{"$f":"'Räkna på nyttorna'!M279/T5","v":0},{"$f":"'Räkna på nyttorna'!N279/U5","v":0},{"$f":"'Räkna på nyttorna'!O279/V5","v":0},{"$f":"'Räkna på nyttorna'!P279/W5","v":0},{"$f":"'Räkna på nyttorna'!Q279/X5","v":0},{"$f":"SUM(NyttorMin[[#This Row],[År 1]:[År 6]])","v":0},null,17,{"$f":"'Räkna på nyttorna'!L280/AB5","v":0},{"$f":"'Räkna på nyttorna'!M280/AC5","v":0},{"$f":"'Räkna på nyttorna'!N280/AD5","v":0},{"$f":"'Räkna på nyttorna'!O280/AE5","v":0},{"$f":"'Räkna på nyttorna'!P280/AF5","v":0},{"$f":"'Räkna på nyttorna'!Q280/AG5","v":0},{"$f":"SUM(NyttorMax[[#This Row],[År 1]:[År 6]])","v":0}]
[null,18,{"$f":"'Räkna på nyttorna'!C295","v":0},{"$f":"'Räkna på nyttorna'!E294","v":0},{"$f":"'Räkna på nyttorna'!C297","v":0},{"$f":"'Räkna på nyttorna'!L295/F5","v":0},{"$f":"'Räkna på nyttorna'!M295/G5","v":0},{"$f":"'Räkna på nyttorna'!N295/H5","v":0},{"$f":"'Räkna på nyttorna'!O295/I5","v":0},{"$f":"'Räkna på nyttorna'!P295/J5","v":0},{"$f":"'Räkna på nyttorna'!Q295/K5","v":0},{"$f":"SUM(Nyttor[[#This Row],[År 1]:[År 6]])","v":0},{"$f":"NyttorMin[[#This Row],[Summa]]","v":0},{"$f":"NyttorMax[[#This Row],[Summa]]","v":0},0,"",null,18,{"$f":"'Räkna på nyttorna'!L296/S5","v":0},{"$f":"'Räkna på nyttorna'!M296/T5","v":0},{"$f":"'Räkna på nyttorna'!N296/U5","v":0},{"$f":"'Räkna på nyttorna'!O296/V5","v":0},{"$f":"'Räkna på nyttorna'!P296/W5","v":0},{"$f":"'Räkna på nyttorna'!Q296/X5","v":0},{"$f":"SUM(NyttorMin[[#This Row],[År 1]:[År 6]])","v":0},null,18,{"$f":"'Räkna på nyttorna'!L297/AB5","v":0},{"$f":"'Räkna på nyttorna'!M297/AC5","v":0},{"$f":"'Räkna på nyttorna'!N297/AD5","v":0},{"$f":"'Räkna på nyttorna'!O297/AE5","v":0},{"$f":"'Räkna på nyttorna'!P297/AF5","v":0},{"$f":"'Räkna på nyttorna'!Q297/AG5","v":0},{"$f":"SUM(NyttorMax[[#This Row],[År 1]:[År 6]])","v":0}]
[null,19,{"$f":"'Räkna på nyttorna'!C312","v":0},{"$f":"'Räkna på nyttorna'!E311","v":0},{"$f":"'Räkna på nyttorna'!C314","v":0},{"$f":"'Räkna på nyttorna'!L312/F5","v":0},{"$f":"'Räkna på nyttorna'!M312/G5","v":0},{"$f":"'Räkna på nyttorna'!N312/H5","v":0},{"$f":"'Räkna på nyttorna'!O312/I5","v":0},{"$f":"'Räkna på nyttorna'!P312/J5","v":0},{"$f":"'Räkna på nyttorna'!Q312/K5","v":0},{"$f":"SUM(Nyttor[[#This Row],[År 1]:[År 6]])","v":0},{"$f":"NyttorMin[[#This Row],[Summa]]","v":0},{"$f":"NyttorMax[[#This Row],[Summa]]","v":0},0,"",null,19,{"$f":"'Räkna på nyttorna'!L313/S5","v":0},{"$f":"'Räkna på nyttorna'!M313/T5","v":0},{"$f":"'Räkna på nyttorna'!N313/U5","v":0},{"$f":"'Räkna på nyttorna'!O313/V5","v":0},{"$f":"'Räkna på nyttorna'!P313/W5","v":0},{"$f":"'Räkna på nyttorna'!Q313/X5","v":0},{"$f":"SUM(NyttorMin[[#This Row],[År 1]:[År 6]])","v":0},null,19,{"$f":"'Räkna på nyttorna'!L314/AB5","v":0},{"$f":"'Räkna på nyttorna'!M314/AC5","v":0},{"$f":"'Räkna på nyttorna'!N314/AD5","v":0},{"$f":"'Räkna på nyttorna'!O314/AE5","v":0},{"$f":"'Räkna på nyttorna'!P314/AF5","v":0},{"$f":"'Räkna på nyttorna'!Q314/AG5","v":0},{"$f":"SUM(NyttorMax[[#This Row],[År 1]:[År 6]])","v":0}]
[null,20,{"$f":"'Räkna på nyttorna'!C329","v":0},{"$f":"'Räkna på nyttorna'!E328","v":0},{"$f":"'Räkna på nyttorna'!C331","v":0},{"$f":"'Räkna på nyttorna'!L329/F5","v":0},{"$f":"'Räkna på nyttorna'!M329/G5","v":0},{"$f":"'Räkna på nyttorna'!N329/H5","v":0},{"$f":"'Räkna på nyttorna'!O329/I5","v":0},{"$f":"'Räkna på nyttorna'!P329/J5","v":0},{"$f":"'Räkna på nyttorna'!Q329/K5","v":0},{"$f":"SUM(Nyttor[[#This Row],[År 1]:[År 6]])","v":0},{"$f":"NyttorMin[[#This Row],[Summa]]","v":0},{"$f":"NyttorMax[[#This Row],[Summa]]","v":0},0,"",null,20,{"$f":"'Räkna på nyttorna'!L330/S5","v":0},{"$f":"'Räkna på nyttorna'!M330/T5","v":0},{"$f":"'Räkna på nyttorna'!N330/U5","v":0},{"$f":"'Räkna på nyttorna'!O330/V5","v":0},{"$f":"'Räkna på nyttorna'!P330/W5","v":0},{"$f":"'Räkna på nyttorna'!Q330/X5","v":0},{"$f":"SUM(NyttorMin[[#This Row],[År 1]:[År 6]])","v":0},null,20,{"$f":"'Räkna på nyttorna'!L331/AB5","v":0},{"$f":"'Räkna på nyttorna'!M331/AC5","v":0},{"$f":"'Räkna på nyttorna'!N331/AD5","v":0},{"$f":"'Räkna på nyttorna'!O331/AE5","v":0},{"$f":"'Räkna på nyttorna'!P331/AF5","v":0},{"$f":"'Räkna på nyttorna'!Q331/AG5","v":0},{"$f":"SUM(NyttorMax[[#This Row],[År 1]:[År 6]])","v":0}]
[null,21,{"$f":"'Räkna på nyttorna'!C346","v":0},{"$f":"'Räkna på nyttorna'!E346","v":0},{"$f":"'Räkna på nyttorna'!C348","v":0},{"$f":"'Räkna på nyttorna'!L346/F5","v":0},{"$f":"'Räkna på nyttorna'!M346/G5","v":0},{"$f":"'Räkna på nyttorna'!N346/H5","v":0},{"$f":"'Räkna på nyttorna'!O346/I5","v":0},{"$f":"'Räkna på nyttorna'!P346/J5","v":0},{"$f":"'Räkna på nyttorna'!Q346/K5","v":0},{"$f":"SUM(Nyttor[[#This Row],[År 1]:[År 6]])","v":0},{"$f":"NyttorMin[[#This Row],[Summa]]","v":0},{"$f":"NyttorMax[[#This Row],[Summa]]","v":0},0,"",null,21,{"$f":"'Räkna på nyttorna'!L347/S5","v":0},{"$f":"'Räkna på nyttorna'!M347/T5","v":0},{"$f":"'Räkna på nyttorna'!N347/U5","v":0},{"$f":"'Räkna på nyttorna'!O347/V5","v":0},{"$f":"'Räkna på nyttorna'!P347/W5","v":0},{"$f":"'Räkna på nyttorna'!Q347/X5","v":0},{"$f":"SUM(NyttorMin[[#This Row],[År 1]:[År 6]])","v":0},null,21,{"$f":"'Räkna på nyttorna'!L348/AB5","v":0},{"$f":"'Räkna på nyttorna'!M348/AC5","v":0},{"$f":"'Räkna på nyttorna'!N348/AD5","v":0},{"$f":"'Räkna på nyttorna'!O348/AE5","v":0},{"$f":"'Räkna på nyttorna'!P348/AF5","v":0},{"$f":"'Räkna på nyttorna'!Q348/AG5","v":0},{"$f":"SUM(NyttorMax[[#This Row],[År 1]:[År 6]])","v":0}]
[null,"Summa",{"$nulls":3},{"$f":"SUBTOTAL(109,Nyttor[År 1])","v":0},{"$f":"SUBTOTAL(109,Nyttor[År 2])","v":0},{"$f":"SUBTOTAL(109,Nyttor[År 3])","v":{"v":5191691.464827033,"d":"5,191,691 "}},{"$f":"SUBTOTAL(109,Nyttor[År 4])","v":{"v":15121431.45095252,"d":"15,121,431 "}},{"$f":"SUBTOTAL(109,Nyttor[År 5])","v":{"v":44043004.22607531,"d":"44,043,004 "}},{"$f":"SUBTOTAL(109,Nyttor[År 6])","v":{"v":42760198.27774302,"d":"42,760,198 "}},{"$f":"SUM(Nyttor[Summa trolig])","v":{"v":107116325.41959788,"d":"107,116,325 "}},{"$f":"SUM(Nyttor[Summa min])","v":{"v":74415402.53459221,"d":"74,415,403 "}},{"$f":"SUM(Nyttor[Summa max])","v":{"v":138908751.39790547,"d":"138,908,751 "}},{"$f":"SUM(Nyttor[Vägt medel])","v":{"v":106934626.03825827,"d":"106,934,626 "}},null,null,"Summa",{"$f":"SUM(NyttorMin[År 1])","v":0},{"$f":"SUM(NyttorMin[År 2])","v":0},{"$f":"SUM(NyttorMin[År 3])","v":{"v":3606750.0325195594,"d":"3,606,750 "}},{"$f":"SUM(NyttorMin[År 4])","v":{"v":10505097.182095803,"d":"10,505,097 "}},{"$f":"SUM(NyttorMin[År 5])","v":{"v":30597370.433288746,"d":"30,597,370 "}},{"$f":"SUM(NyttorMin[År 6])","v":{"v":29706184.886688106,"d":"29,706,185 "}},{"$f":"SUM(NyttorMin[Summa])","v":{"v":74415402.53459221,"d":"74,415,403 "}},null,null,{"$f":"SUM(NyttorMax[År 1])","v":0},{"$f":"SUM(NyttorMax[År 2])","v":0},{"$f":"SUM(NyttorMax[År 3])","v":{"v":6732600.060703176,"d":"6,732,600 "}},{"$f":"SUM(NyttorMax[År 4])","v":{"v":19609514.73991216,"d":"19,609,515 "}},{"$f":"SUM(NyttorMax[År 5])","v":{"v":57115091.47547232,"d":"57,115,091 "}},{"$f":"SUM(NyttorMax[År 6])","v":{"v":55451545.1218178,"d":"55,451,545 "}},{"$f":"SUM(NyttorMax[Summa])","v":{"v":138908751.39790547,"d":"138,908,751 "}}]

{"sheet":"Kostnader","index":3,"n_rows":94,"n_cols":32,"rows_kept":94,"merged":[[3,5,3,11],[3,12,3,13],[3,28,3,29],[30,2,30,3],[54,2,54,3]]}
[null,"Kostnader"]
[null,{"$f":"IF(Försättsblad!B6=0,\"\",Försättsblad!B6)","v":"Första linjens digitala vård - nya kanaler - video"}]
[]
[{"$nulls":20},"Diskontering",{"$f":"(1+Diskonteringsränta)^0","v":{"v":1,"d":"1.000 "}},{"$f":"(1+Diskonteringsränta)^1","v":{"v":1.03,"d":"1.030 "}},{"$f":"(1+Diskonteringsränta)^2","v":{"v":1.0609,"d":"1.061 "}},{"$f":"(1+Diskonteringsränta)^3","v":{"v":1.092727,"d":"1.093 "}},{"$f":"(1+Diskonteringsränta)^4","v":{"v":1.12550881,"d":"1.126 "}},{"$f":"(1+Diskonteringsränta)^5","v":{"v":1.1592740742999998,"d":"1.159 "}}]
[{"$nulls":5},{"$f":"Startår","v":2019},{"$f":"F5+1","v":2020},{"$f":"G5+1","v":2021},{"$f":"H5+1","v":2022},{"$f":"I5+1","v":2023},{"$f":"J5+1","v":2024},{"$nulls":10},{"$f":"Startår","v":2019},{"$f":"V5+1","v":2020},{"$f":"W5+1","v":2021},2022,2023,2024]
[null,"ID","Kostnadskategori","Kostnadens namn","Intressent ","år 1","år 2","år 3","år 4","år 5","år 6","Summa trolig","Summa min","Summa max","Vägt medel","Osäkerhet",null,"ID","Kostnadskategori","Kostnadens namn","Intressent ","år 1","år 2","år 3","år 4","år 5","år 6","Summa","Min","Max","Vägt medel","Osäkerhet"]
[null,1,{"$nulls":9},{"$f":"SUM(F7:K7)","v":0},{"$f":"0.8*Kostnader4[[#This Row],[Summa trolig]]","v":0},{"$f":"1.2*Kostnader4[[#This Row],[Summa trolig]]","v":0},{"$f":"IF(OR(ISBLANK(N7),ISBLANK(M7),ISBLANK(L7)),\"\",(N7+M7+3*L7)/5)","v":0},{"$f":"IF(OR(ISBLANK(L7),L7=0),\"\",(N7-M7)/5/L7)","v":""},null,1,{"$f":"Kostnader4[[#This Row],[Kostnadskategori]]","v":0},{"$f":"Kostnader4[[#This Row],[Kostnadens namn]]","v":0},{"$f":"Kostnader4[[#This Row],[Intressent ]]","v":0},{"$f":"Kostnader4[[#This Row],[år 1]]/V$4","v":0},{"$f":"Kostnader4[[#This Row],[år 2]]/W$4","v":0},{"$f":"Kostnader4[[#This Row],[år 3]]/X$4","v":0},{"$f":"Kostnader4[[#This Row],[år 4]]/Y$4","v":0},{"$f":"Kostnader4[[#This Row],[år 5]]/Z$4","v":0},{"$f":"Kostnader4[[#This Row],[år 6]]/AA$4","v":0},{"$f":"SUM(V7:AA7)","v":0},{"$f":"0.8*Kostnader[[#This Row],[Summa]]","v":0},{"$f":"1.2*Kostnader[[#This Row],[Summa]]","v":0},{"$f":"IF(OR(ISBLANK(AD7),ISBLANK(AC7),ISBLANK(AB7)),\"\",(AD7+AC7+3*AB7)/5)","v":0},{"$f":"IF(OR(ISBLANK(AB7),AB7=0),\"\",(AD7-AC7)/5/AB7)","v":""}]
[null,2,{"$nulls":9},0,{"$f":"0.8*Kostnader4[[#This Row],[Summa trolig]]","v":0},{"$f":"1.2*Kostnader4[[#This Row],[Summa trolig]]","v":0},0,"",null,2,{"$f":"Kostnader4[[#This Row],[Kostnadskategori]]","v":0},{"$f":"Kostnader4[[#This Row],[Kostnadens namn]]","v":0},{"$f":"Kostnader4[[#This Row],[Intressent ]]","v":0},{"$f":"Kostnader4[[#This Row],[år 1]]/V$4","v":0},{"$f":"Kostnader4[[#This Row],[år 2]]/W$4","v":0},{"$f":"Kostnader4[[#This Row],[år 3]]/X$4","v":0},{"$f":"Kostnader4[[#This Row],[år 4]]/Y$4","v":0},{"$f":"Kostnader4[[#This Row],[år 5]]/Z$4","v":0},{"$f":"Kostnader4[[#This Row],[år 6]]/AA$4","v":0},{"$f":"SUM(V8:AA8)","v":0},{"$f":"0.8*Kostnader[[#This Row],[Summa]]","v":0},{"$f":"1.2*Kostnader[[#This Row],[Summa]]","v":0},0,""]
[null,3,{"$nulls":9},0,{"$f":"0.8*Kostnader4[[#This Row],[Summa trolig]]","v":0},{"$f":"1.2*Kostnader4[[#This Row],[Summa trolig]]","v":0},0,"",null,3,{"$f":"Kostnader4[[#This Row],[Kostnadskategori]]","v":0},{"$f":"Kostnader4[[#This Row],[Kostnadens namn]]","v":0},{"$f":"Kostnader4[[#This Row],[Intressent ]]","v":0},{"$f":"Kostnader4[[#This Row],[år 1]]/V$4","v":0},{"$f":"Kostnader4[[#This Row],[år 2]]/W$4","v":0},{"$f":"Kostnader4[[#This Row],[år 3]]/X$4","v":0},{"$f":"Kostnader4[[#This Row],[år 4]]/Y$4","v":0},{"$f":"Kostnader4[[#This Row],[år 5]]/Z$4","v":0},{"$f":"Kostnader4[[#This Row],[år 6]]/AA$4","v":0},0,{"$f":"0.8*Kostnader[[#This Row],[Summa]]","v":0},{"$f":"1.2*Kostnader[[#This Row],[Summa]]","v":0},0,""]
[null,4,{"$nulls":9},0,{"$f":"0.8*Kostnader4[[#This Row],[Summa trolig]]","v":0},{"$f":"1.2*Kostnader4[[#This Row],[Summa trolig]]","v":0},0,"",null,4,{"$f":"Kostnader4[[#This Row],[Kostnadskategori]]","v":0},{"$f":"Kostnader4[[#This Row],[Kostnadens namn]]","v":0},{"$f":"Kostnader4[[#This Row],[Intressent ]]","v":0},{"$f":"Kostnader4[[#This Row],[år 1]]/V$4","v":0},{"$f":"Kostnader4[[#This Row],[år 2]]/W$4","v":0},{"$f":"Kostnader4[[#This Row],[år 3]]/X$4","v":0},{"$f":"Kostnader4[[#This Row],[år 4]]/Y$4","v":0},{"$f":"Kostnader4[[#This Row],[år 5]]/Z$4","v":0},{"$f":"Kostnader4[[#This Row],[år 6]]/AA$4","v":0},0,{"$f":"0.8*Kostnader[[#This Row],[Summa]]","v":0},{"$f":"1.2*Kostnader[[#This Row],[Summa]]","v":0},0,""]
[null,5,{"$nulls":9},0,{"$f":"0.8*Kostnader4[[#This Row],[Summa trolig]]","v":0},{"$f":"1.2*Kostnader4[[#This Row],[Summa trolig]]","v":0},0,"",null,5,{"$f":"Kostnader4[[#This Row],[Kostnadskategori]]","v":0},{"$f":"Kostnader4[[#This Row],[Kostnadens namn]]","v":0},{"$f":"Kostnader4[[#This Row],[Intressent ]]","v":0},{"$f":"Kostnader4[[#This Row],[år 1]]/V$4","v":0},{"$f":"Kostnader4[[#This Row],[år 2]]/W$4","v":0},{"$f":"Kostnader4[[#This Row],[år 3]]/X$4","v":0},{"$f":"Kostnader4[[#This Row],[år 4]]/Y$4","v":0},{"$f":"Kostnader4[[#This Row],[år 5]]/Z$4","v":0},{"$f":"Kostnader4[[#This Row],[år 6]]/AA$4","v":0},0,{"$f":"0.8*Kostnader[[#This Row],[Summa]]","v":0},{"$f":"1.2*Kostnader[[#This Row],[Summa]]","v":0},0,""]
[null,6,{"$nulls":9},0,{"$f":"0.8*Kostnader4[[#This Row],[Summa trolig]]","v":0},{"$f":"1.2*Kostnader4[[#This Row],[Summa trolig]]","v":0},0,"",null,6,{"$f":"Kostnader4[[#This Row],[Kostnadskategori]]","v":0},{"$f":"Kostnader4[[#This Row],[Kostnadens namn]]","v":0},{"$f":"Kostnader4[[#This Row],[Intressent ]]","v":0},{"$f":"Kostnader4[[#This Row],[år 1]]/V$4","v":0},{"$f":"Kostnader4[[#This Row],[år 2]]/W$4","v":0},{"$f":"Kostnader4[[#This Row],[år 3]]/X$4","v":0},{"$f":"Kostnader4[[#This Row],[år 4]]/Y$4","v":0},{"$f":"Kostnader4[[#This Row],[år 5]]/Z$4","v":0},{"$f":"Kostnader4[[#This Row],[år 6]]/AA$4","v":0},0,{"$f":"0.8*Kostnader[[#This Row],[Summa]]","v":0},{"$f":"1.2*Kostnader[[#This Row],[Summa]]","v":0},0,""]
[null,7,{"$nulls":9},0,{"$f":"0.8*Kostnader4[[#This Row],[Summa trolig]]","v":0},{"$f":"1.2*Kostnader4[[#This Row],[Summa trolig]]","v":0},0,"",null,7,{"$f":"Kostnader4[[#This Row],[Kostnadskategori]]","v":0},{"$f":"Kostnader4[[#This Row],[Kostnadens namn]]","v":0},{"$f":"Kostnader4[[#This Row],[Intressent ]]","v":0},{"$f":"Kostnader4[[#This Row],[år 1]]/V$4","v":0},{"$f":"Kostnader4[[#This Row],[år 2]]/W$4","v":0},{"$f":"Kostnader4[[#This Row],[år 3]]/X$4","v":0},{"$f":"Kostnader4[[#This Row],[år 4]]/Y$4","v":0},{"$f":"Kostnader4[[#This Row],[år 5]]/Z$4","v":0},{"$f":"Kostnader4[[#This Row],[år 6]]/AA$4","v":0},0,{"$f":"0.8*Kostnader[[#This Row],[Summa]]","v":0},{"$f":"1.2*Kostnader[[#This Row],[Summa]]","v":0},0,""]
[null,8,"4. Projekt","Projekt Inera - etapp 1 - utveckling av verktyg och piloter","Inera",{"$f":"4895000/2","v":{"v":2447500,"d":"2,447,500 "}},{"$nulls":5},{"v":2447500,"d":"2,447,500 "},{"$f":"0.8*Kostnader4[[#This Row],[Summa trolig]]","v":{"v":1958000,"d":"1,958,000 "}},{"$f":"1.2*Kostnader4[[#This Row],[Summa trolig]]","v":{"v":2937000,"d":"2,937,000 "}},{"v":2447500,"d":"2,447,500 "},{"v":0.08,"d":"8%"},null,8,{"$f":"Kostnader4[[#This Row],[Kostnadskategori]]","v":"4. Projekt"},{"$f":"Kostnader4[[#This Row],[Kostnadens namn]]","v":"Projekt Inera - etapp 1 - utveckling av verktyg och piloter"},{"$f":"Kostnader4[[#This Row],[Intressent ]]","v":"Inera"},{"$f":"Kostnader4[[#This Row],[år 1]]/V$4","v":{"v":2447500,"d":"2,447,500 "}},{"$f":"Kostnader4[[#This Row],[år 2]]/W$4","v":0},{"$f":"Kostnader4[[#This Row],[år 3]]/X$4","v":0},{"$f":"Kostnader4[[#This Row],[år 4]]/Y$4","v":0},{"$f":"Kostnader4[[#This Row],[år 5]]/Z$4","v":0},{"$f":"Kostnader4[[#This Row],[år 6]]/AA$4","v":0},{"v":2447500,"d":"2,447,500 "},{"$f":"0.8*Kostnader[[#This Row],[Summa]]","v":{"v":1958000,"d":"1,958,000 "}},{"$f":"1.2*Kostnader[[#This Row],[Summa]]","v":{"v":2937000,"d":"2,937,000 "}},{"v":2447500,"d":"2,447,500 "},{"v":0.08,"d":"8%"}]
[null,9,{"$nulls":9},0,{"$f":"0.8*Kostnader4[[#This Row],[Summa trolig]]","v":0},{"$f":"1.2*Kostnader4[[#This Row],[Summa trolig]]","v":0},0,"",null,9,{"$f":"Kostnader4[[#This Row],[Kostnadskategori]]","v":0},{"$f":"Kostnader4[[#This Row],[Kostnadens namn]]","v":0},{"$f":"Kostnader4[[#This Row],[Intressent ]]","v":0},{"$f":"Kostnader4[[#This Row],[år 1]]/V$4","v":0},{"$f":"Kostnader4[[#This Row],[år 2]]/W$4","v":0},{"$f":"Kostnader4[[#This Row],[år 3]]/X$4","v":0},{"$f":"Kostnader4[[#This Row],[år 4]]/Y$4","v":0},{"$f":"Kostnader4[[#This Row],[år 5]]/Z$4","v":0},{"$f":"Kostnader4[[#This Row],[år 6]]/AA$4","v":0},0,{"$f":"0.8*Kostnader[[#This Row],[Summa]]","v":0},{"$f":"1.2*Kostnader[[#This Row],[Summa]]","v":0},0,""]
[null,10,{"$nulls":9},0,{"$f":"0.8*Kostnader4[[#This Row],[Summa trolig]]","v":0},{"$f":"1.2*Kostnader4[[#This Row],[Summa trolig]]","v":0},0,"",null,10,{"$f":"Kostnader4[[#This Row],[Kostnadskategori]]","v":0},{"$f":"Kostnader4[[#This Row],[Kostnadens namn]]","v":0},{"$f":"Kostnader4[[#This Row],[Intressent ]]","v":0},{"$f":"Kostnader4[[#This Row],[år 1]]/V$4","v":0},{"$f":"Kostnader4[[#This Row],[år 2]]/W$4","v":0},{"$f":"Kostnader4[[#This Row],[år 3]]/X$4","v":0},{"$f":"Kostnader4[[#This Row],[år 4]]/Y$4","v":0},{"$f":"Kostnader4[[#This Row],[år 5]]/Z$4","v":0},{"$f":"Kostnader4[[#This Row],[år 6]]/AA$4","v":0},0,{"$f":"0.8*Kostnader[[#This Row],[Summa]]","v":0},{"$f":"1.2*Kostnader[[#This Row],[Summa]]","v":0},0,""]
[null,11,"4. Projekt","Projekt Inera - etapp 2 - förberedelse för video","Staten",0,{"v":2000000,"d":"2,000,000 "},{"v":4000000,"d":"4,000,000 "},0,0,0,{"v":6000000,"d":"6,000,000 "},{"$f":"0.8*Kostnader4[[#This Row],[Summa trolig]]","v":{"v":4800000,"d":"4,800,000 "}},{"$f":"1.2*Kostnader4[[#This Row],[Summa trolig]]","v":{"v":7200000,"d":"7,200,000 "}},{"v":6000000,"d":"6,000,000 "},{"v":0.08,"d":"8%"},null,11,{"$f":"Kostnader4[[#This Row],[Kostnadskategori]]","v":"4. Projekt"},{"$f":"Kostnader4[[#This Row],[Kostnadens namn]]","v":"Projekt Inera - etapp 2 - förberedelse för video"},{"$f":"Kostnader4[[#This Row],[Intressent ]]","v":"Staten"},{"$f":"Kostnader4[[#This Row],[år 1]]/V$4","v":0},{"$f":"Kostnader4[[#This Row],[år 2]]/W$4","v":{"v":1941747.572815534,"d":"1,941,748 "}},{"$f":"Kostnader4[[#This Row],[år 3]]/X$4","v":{"v":3770383.6365350178,"d":"3,770,384 "}},{"$f":"Kostnader4[[#This Row],[år 4]]/Y$4","v":0},{"$f":"Kostnader4[[#This Row],[år 5]]/Z$4","v":0},{"$f":"Kostnader4[[#This Row],[år 6]]/AA$4","v":0},{"v":5712131.2093505515,"d":"5,712,131 "},{"$f":"0.8*Kostnader[[#This Row],[Summa]]","v":{"v":4569704.967480442,"d":"4,569,705 "}},{"$f":"1.2*Kostnader[[#This Row],[Summa]]","v":{"v":6854557.451220661,"d":"6,854,557 "}},{"v":5712131.2093505515,"d":"5,712,131 "},{"v":0.07999999999999997,"d":"8%"}]
[null,12,"2. Löpande verksamhetskostnader","Video - förvaltning 2021","Staten",0,0,{"v":7000000,"d":"7,000,000 "},0,0,0,{"v":7000000,"d":"7,000,000 "},{"$f":"0.8*Kostnader4[[#This Row],[Summa trolig]]","v":{"v":5600000,"d":"5,600,000 "}},{"$f":"1.2*Kostnader4[[#This Row],[Summa trolig]]","v":{"v":8400000,"d":"8,400,000 "}},{"v":7000000,"d":"7,000,000 "},{"v":0.08,"d":"8%"},null,12,{"$f":"Kostnader4[[#This Row],[Kostnadskategori]]","v":"2. Löpande verksamhetskostnader"},{"$f":"Kostnader4[[#This Row],[Kostnadens namn]]","v":"Video - förvaltning 2021"},{"$f":"Kostnader4[[#This Row],[Intressent ]]","v":"Staten"},{"$f":"Kostnader4[[#This Row],[år 1]]/V$4","v":0},{"$f":"Kostnader4[[#This Row],[år 2]]/W$4","v":0},{"$f":"Kostnader4[[#This Row],[år 3]]/X$4","v":{"v":6598171.363936281,"d":"6,598,171 "}},{"$f":"Kostnader4[[#This Row],[år 4]]/Y$4","v":0},{"$f":"Kostnader4[[#This Row],[år 5]]/Z$4","v":0},{"$f":"Kostnader4[[#This Row],[år 6]]/AA$4","v":0},{"v":6598171.363936281,"d":"6,598,171 "},{"$f":"0.8*Kostnader[[#This Row],[Summa]]","v":{"v":5278537.091149025,"d":"5,278,537 "}},{"$f":"1.2*Kostnader[[#This Row],[Summa]]","v":{"v":7917805.636723537,"d":"7,917,806 "}},{"v":6598171.363936281,"d":"6,598,171 "},{"v":0.07999999999999999,"d":"8%"}]
[null,13,"2. Löpande verksamhetskostnader","Video - förvaltning 2022 - 2024","Regioner",0,0,0,{"v":5000000,"d":"5,000,000 "},{"v":5000000,"d":"5,000,000 "},{"v":5000000,"d":"5,000,000 "},{"v":15000000,"d":"15,000,000 "},{"$f":"0.8*Kostnader4[[#This Row],[Summa trolig]]","v":{"v":12000000,"d":"12,000,000 "}},{"$f":"1.2*Kostnader4[[#This Row],[Summa trolig]]","v":{"v":18000000,"d":"18,000,000 "}},{"v":15000000,"d":"15,000,000 "},{"v":0.08,"d":"8%"},null,13,{"$f":"Kostnader4[[#This Row],[Kostnadskategori]]","v":"2. Löpande verksamhetskostnader"},{"$f":"Kostnader4[[#This Row],[Kostnadens namn]]","v":"Video - förvaltning 2022 - 2024"},{"$f":"Kostnader4[[#This Row],[Intressent ]]","v":"Regioner"},{"$f":"Kostnader4[[#This Row],[år 1]]/V$4","v":0},{"$f":"Kostnader4[[#This Row],[år 2]]/W$4","v":0},{"$f":"Kostnader4[[#This Row],[år 3]]/X$4","v":0},{"$f":"Kostnader4[[#This Row],[år 4]]/Y$4","v":{"v":4575708.296765798,"d":"4,575,708 "}},{"$f":"Kostnader4[[#This Row],[år 5]]/Z$4","v":{"v":4442435.2395784445,"d":"4,442,435 "}},{"$f":"Kostnader4[[#This Row],[år 6]]/AA$4","v":{"v":4313043.92192082,"d":"4,313,044 "}},{"v":13331187.458265062,"d":"13,331,187 "},{"$f":"0.8*Kostnader[[#This Row],[Summa]]","v":{"v":10664949.96661205,"d":"10,664,950 "}},{"$f":"1.2*Kostnader[[#This Row],[Summa]]","v":{"v":15997424.949918075,"d":"15,997,425 "}},{"v":13331187.458265062,"d":"13,331,187 "},{"v":0.07999999999999999,"d":"8%"}]
[null,14,"1. Verksamhetsförändring","Video - införande 20 regioner","Regioner",null,null,{"v":350000,"d":"350,000 "},{"v":300000,"d":"300,000 "},null,null,{"v":650000,"d":"650,000 "},{"$f":"0.8*Kostnader4[[#This Row],[Summa trolig]]","v":{"v":520000,"d":"520,000 "}},{"$f":"1.2*Kostnader4[[#This Row],[Summa trolig]]","v":{"v":780000,"d":"780,000 "}},{"v":650000,"d":"650,000 "},{"v":0.08,"d":"8%"},null,14,{"$f":"Kostnader4[[#This Row],[Kostnadskategori]]","v":"1. Verksamhetsförändring"},{"$f":"Kostnader4[[#This Row],[Kostnadens namn]]","v":"Video - införande 20 regioner"},{"$f":"Kostnader4[[#This Row],[Intressent ]]","v":"Regioner"},{"$f":"Kostnader4[[#This Row],[år 1]]/V$4","v":0},{"$f":"Kostnader4[[#This Row],[år 2]]/W$4","v":0},{"$f":"Kostnader4[[#This Row],[år 3]]/X$4","v":{"v":329908.56819681404,"d":"329,909 "}},{"$f":"Kostnader4[[#This Row],[år 4]]/Y$4","v":{"v":274542.49780594785,"d":"274,542 "}},{"$f":"Kostnader4[[#This Row],[år 5]]/Z$4","v":0},{"$f":"Kostnader4[[#This Row],[år 6]]/AA$4","v":0},{"v":604451.066002762,"d":"604,451 "},{"$f":"0.8*Kostnader[[#This Row],[Summa]]","v":{"v":483560.85280220956,"d":"483,561 "}},{"$f":"1.2*Kostnader[[#This Row],[Summa]]","v":{"v":725341.2792033143,"d":"725,341 "}},{"v":604451.066002762,"d":"604,451 "},{"v":0.08,"d":"8%"}]
[null,15,"4. Projekt","Video - pilotregionernas resurser i pilot 2019","Regioner",{"v":313000,"d":"313,000 "},{"$nulls":5},{"v":313000,"d":"313,000 "},{"$f":"0.8*Kostnader4[[#This Row],[Summa trolig]]","v":{"v":250400,"d":"250,400 "}},{"$f":"1.2*Kostnader4[[#This Row],[Summa trolig]]","v":{"v":375600,"d":"375,600 "}},{"v":313000,"d":"313,000 "},{"v":0.08,"d":"8%"},null,15,{"$f":"Kostnader4[[#This Row],[Kostnadskategori]]","v":"4. Projekt"},{"$f":"Kostnader4[[#This Row],[Kostnadens namn]]","v":"Video - pilotregionernas resurser i pilot 2019"},{"$f":"Kostnader4[[#This Row],[Intressent ]]","v":"Regioner"},{"$f":"Kostnader4[[#This Row],[år 1]]/V$4","v":{"v":313000,"d":"313,000 "}},{"$f":"Kostnader4[[#This Row],[år 2]]/W$4","v":0},{"$f":"Kostnader4[[#This Row],[år 3]]/X$4","v":0},{"$f":"Kostnader4[[#This Row],[år 4]]/Y$4","v":0},{"$f":"Kostnader4[[#This Row],[år 5]]/Z$4","v":0},{"$f":"Kostnader4[[#This Row],[år 6]]/AA$4","v":0},{"v":313000,"d":"313,000 "},{"$f":"0.8*Kostnader[[#This Row],[Summa]]","v":{"v":250400,"d":"250,400 "}},{"$f":"1.2*Kostnader[[#This Row],[Summa]]","v":{"v":375600,"d":"375,600 "}},{"v":313000,"d":"313,000 "},{"v":0.08,"d":"8%"}]
[null,16,"4. Projekt","Video - utbildning 40 sjuksköterskor i pilot 2019","Regioner",{"v":108000,"d":"108,000 "},{"$nulls":5},{"v":108000,"d":"108,000 "},{"$f":"0.8*Kostnader4[[#This Row],[Summa trolig]]","v":{"v":86400,"d":"86,400 "}},{"$f":"1.2*Kostnader4[[#This Row],[Summa trolig]]","v":{"v":129600,"d":"129,600 "}},{"v":108000,"d":"108,000 "},{"v":0.08,"d":"8%"},null,16,{"$f":"Kostnader4[[#This Row],[Kostnadskategori]]","v":"4. Projekt"},{"$f":"Kostnader4[[#This Row],[Kostnadens namn]]","v":"Video - utbildning 40 sjuksköterskor i pilot 2019"},{"$f":"Kostnader4[[#This Row],[Intressent ]]","v":"Regioner"},{"$f":"Kostnader4[[#This Row],[år 1]]/V$4","v":{"v":108000,"d":"108,000 "}},{"$f":"Kostnader4[[#This Row],[år 2]]/W$4","v":0},{"$f":"Kostnader4[[#This Row],[år 3]]/X$4","v":0},{"$f":"Kostnader4[[#This Row],[år 4]]/Y$4","v":0},{"$f":"Kostnader4[[#This Row],[år 5]]/Z$4","v":0},{"$f":"Kostnader4[[#This Row],[år 6]]/AA$4","v":0},{"v":108000,"d":"108,000 "},{"$f":"0.8*Kostnader[[#This Row],[Summa]]","v":{"v":86400,"d":"86,400 "}},{"$f":"1.2*Kostnader[[#This Row],[Summa]]","v":{"v":129600,"d":"129,600 "}},{"v":108000,"d":"108,000 "},{"v":0.08,"d":"8%"}]
[null,17,"2. Löpande verksamhetskostnader","Video - utbildning sjuksköterskor breddinförande","Regioner",null,null,{"$f":"(L81+G88)","v":{"v":2723840,"d":"2,723,840 "}},{"$nulls":3},{"v":2723840,"d":"2,723,840 "},{"$f":"0.8*Kostnader4[[#This Row],[Summa trolig]]","v":{"v":2179072,"d":"2,179,072 "}},{"$f":"1.2*Kostnader4[[#This Row],[Summa trolig]]","v":{"v":3268608,"d":"3,268,608 "}},{"v":2723840,"d":"2,723,840 "},{"v":0.08,"d":"8%"},null,17,{"$f":"Kostnader4[[#This Row],[Kostnadskategori]]","v":"2. Löpande verksamhetskostnader"},{"$f":"Kostnader4[[#This Row],[Kostnadens namn]]","v":"Video - utbildning sjuksköterskor breddinförande"},{"$f":"Kostnader4[[#This Row],[Intressent ]]","v":"Regioner"},{"$f":"Kostnader4[[#This Row],[år 1]]/V$4","v":0},{"$f":"Kostnader4[[#This Row],[år 2]]/W$4","v":0},{"$f":"Kostnader4[[#This Row],[år 3]]/X$4","v":{"v":2567480.4411348854,"d":"2,567,480 "}},{"$f":"Kostnader4[[#This Row],[år 4]]/Y$4","v":0},{"$f":"Kostnader4[[#This Row],[år 5]]/Z$4","v":0},{"$f":"Kostnader4[[#This Row],[år 6]]/AA$4","v":0},{"v":2567480.4411348854,"d":"2,567,480 "},{"$f":"0.8*Kostnader[[#This Row],[Summa]]","v":{"v":2053984.3529079084,"d":"2,053,984 "}},{"$f":"1.2*Kostnader[[#This Row],[Summa]]","v":{"v":3080976.529361862,"d":"3,080,977 "}},{"v":2567480.441134886,"d":"2,567,480 "},{"v":0.07999999999999997,"d":"8%"}]
[null,18,"2. Löpande verksamhetskostnader","Video - årlig utbildning sjuksköterskor","Regioner",{"$nulls":3},{"$f":"$G$94","v":{"v":152000,"d":"152,000 "}},{"$f":"$G$94","v":{"v":152000,"d":"152,000 "}},{"v":152000,"d":"152,000 "},{"v":456000,"d":"456,000 "},{"$f":"0.8*Kostnader4[[#This Row],[Summa trolig]]","v":{"v":364800,"d":"364,800 "}},{"$f":"1.2*Kostnader4[[#This Row],[Summa trolig]]","v":{"v":547200,"d":"547,200 "}},{"v":456000,"d":"456,000 "},{"v":0.08,"d":"8%"},null,18,{"$f":"Kostnader4[[#This Row],[Kostnadskategori]]","v":"2. Löpande verksamhetskostnader"},{"$f":"Kostnader4[[#This Row],[Kostnadens namn]]","v":"Video - årlig utbildning sjuksköterskor"},{"$f":"Kostnader4[[#This Row],[Intressent ]]","v":"Regioner"},{"$f":"Kostnader4[[#This Row],[år 1]]/V$4","v":0},{"$f":"Kostnader4[[#This Row],[år 2]]/W$4","v":0},{"$f":"Kostnader4[[#This Row],[år 3]]/X$4","v":0},{"$f":"Kostnader4[[#This Row],[år 4]]/Y$4","v":{"v":139101.53222168025,"d":"139,102 "}},{"$f":"Kostnader4[[#This Row],[år 5]]/Z$4","v":{"v":135050.0312831847,"d":"135,050 "}},{"$f":"Kostnader4[[#This Row],[år 6]]/AA$4","v":{"v":131116.53522639294,"d":"131,117 "}},{"v":405268.09873125784,"d":"405,268 "},{"$f":"0.8*Kostnader[[#This Row],[Summa]]","v":{"v":324214.4789850063,"d":"324,214 "}},{"$f":"1.2*Kostnader[[#This Row],[Summa]]","v":{"v":486321.7184775094,"d":"486,322 "}},{"v":405268.09873125784,"d":"405,268 "},{"v":0.07999999999999999,"d":"8%"}]
[null,19,"2. Löpande verksamhetskostnader","Video - ökad bemanning pga längre samtalstider","Regioner",null,null,{"$f":"D74/2","v":{"v":2730600,"d":"2,730,600 "}},{"$f":"$D$74","v":{"v":5461200,"d":"5,461,200 "}},{"v":5461200,"d":"5,461,200 "},{"v":5461200,"d":"5,461,200 "},{"$f":"SUM(F25:K25)","v":{"v":19114200,"d":"19,114,200 "}},{"$f":"0.8*Kostnader4[[#This Row],[Summa trolig]]","v":{"v":15291360,"d":"15,291,360 "}},{"$f":"1.2*Kostnader4[[#This Row],[Summa trolig]]","v":{"v":22937040,"d":"22,937,040 "}},{"$f":"IF(OR(ISBLANK(N25),ISBLANK(M25),ISBLANK(L25)),\"\",(N25+M25+3*L25)/5)","v":{"v":19114200,"d":"19,114,200 "}},{"$f":"IF(OR(ISBLANK(L25),L25=0),\"\",(N25-M25)/5/L25)","v":{"v":0.08,"d":"8%"}},null,19,{"$f":"Kostnader4[[#This Row],[Kostnadskategori]]","v":"2. Löpande verksamhetskostnader"},{"$f":"Kostnader4[[#This Row],[Kostnadens namn]]","v":"Video - ökad bemanning pga längre samtalstider"},{"$f":"Kostnader4[[#This Row],[Intressent ]]","v":"Regioner"},{"$f":"Kostnader4[[#This Row],[år 1]]/V$4","v":0},{"$f":"Kostnader4[[#This Row],[år 2]]/W$4","v":0},{"$f":"Kostnader4[[#This Row],[år 3]]/X$4","v":{"v":2573852.38948063,"d":"2,573,852 "}},{"$f":"Kostnader4[[#This Row],[år 4]]/Y$4","v":{"v":4997771.630059475,"d":"4,997,772 "}},{"$f":"Kostnader4[[#This Row],[år 5]]/Z$4","v":{"v":4852205.466077161,"d":"4,852,205 "}},{"$f":"Kostnader4[[#This Row],[år 6]]/AA$4","v":{"v":4710879.093278797,"d":"4,710,879 "}},{"v":17134708.57889606,"d":"17,134,709 "},{"$f":"0.8*Kostnader[[#This Row],[Summa]]","v":{"v":13707766.86311685,"d":"13,707,767 "}},{"$f":"1.2*Kostnader[[#This Row],[Summa]]","v":{"v":20561650.294675272,"d":"20,561,650 "}},{"v":17134708.57889606,"d":"17,134,709 "},{"v":0.07999999999999999,"d":"8%"}]
[null,20,{"$nulls":9},{"$f":"SUM(F25:K25)","v":{"v":19114200,"d":"19,114,200 "}},{"$f":"0.8*Kostnader4[[#This Row],[Summa trolig]]","v":{"v":15291360,"d":"15,291,360 "}},{"$f":"1.2*Kostnader4[[#This Row],[Summa trolig]]","v":{"v":22937040,"d":"22,937,040 "}},{"v":19114200,"d":"19,114,200 "},{"v":0.08,"d":"8%"},null,20,{"$f":"Kostnader4[[#This Row],[Kostnadskategori]]","v":0},{"$f":"Kostnader4[[#This Row],[Kostnadens namn]]","v":0},{"$f":"Kostnader4[[#This Row],[Intressent ]]","v":0},{"$f":"Kostnader4[[#This Row],[år 1]]/V$4","v":0},{"$f":"Kostnader4[[#This Row],[år 2]]/W$4","v":0},{"$f":"Kostnader4[[#This Row],[år 3]]/X$4","v":0},{"$f":"Kostnader4[[#This Row],[år 4]]/Y$4","v":0},{"$f":"Kostnader4[[#This Row],[år 5]]/Z$4","v":0},{"$f":"Kostnader4[[#This Row],[år 6]]/AA$4","v":0},0,{"$f":"0.8*Kostnader[[#This Row],[Summa]]","v":0},{"$f":"1.2*Kostnader[[#This Row],[Summa]]","v":0},0,""]
[null,21,{"$nulls":9},0,{"$f":"0.8*Kostnader4[[#This Row],[Summa trolig]]","v":0},{"$f":"1.2*Kostnader4[[#This Row],[Summa trolig]]","v":0},0,"",null,21,{"$f":"Kostnader4[[#This Row],[Kostnadskategori]]","v":0},{"$f":"Kostnader4[[#This Row],[Kostnadens namn]]","v":0},{"$f":"Kostnader4[[#This Row],[Intressent ]]","v":0},{"$f":"Kostnader4[[#This Row],[år 1]]/V$4","v":0},{"$f":"Kostnader4[[#This Row],[år 2]]/W$4","v":0},{"$f":"Kostnader4[[#This Row],[år 3]]/X$4","v":0},{"$f":"Kostnader4[[#This Row],[år 4]]/Y$4","v":0},{"$f":"Kostnader4[[#This Row],[år 5]]/Z$4","v":0},{"$f":"Kostnader4[[#This Row],[år 6]]/AA$4","v":0},0,{"$f":"0.8*Kostnader[[#This Row],[Summa]]","v":0},{"$f":"1.2*Kostnader[[#This Row],[Summa]]","v":0},0,""]
[null,"Summa",{"$nulls":3},{"$f":"SUBTOTAL(109,Kostnader4[år 1])","v":{"v":2868500,"d":"2,868,500 "}},{"$f":"SUBTOTAL(109,Kostnader4[år 2])","v":{"v":2000000,"d":"2,000,000 "}},{"$f":"SUBTOTAL(109,Kostnader4[år 3])","v":{"v":16804440,"d":"16,804,440 "}},{"$f":"SUBTOTAL(109,Kostnader4[år 4])","v":{"v":10913200,"d":"10,913,200 "}},{"$f":"SUBTOTAL(109,Kostnader4[år 5])","v":{"v":10613200,"d":"10,613,200 "}},{"$f":"SUBTOTAL(109,Kostnader4[år 6])","v":{"v":10613200,"d":"10,613,200 "}},{"$f":"SUM(Kostnader4[Summa trolig])","v":{"v":72926740,"d":"72,926,740 "}},{"$f":"SUM(Kostnader4[Summa min])","v":{"v":58341392,"d":"58,341,392 "}},{"$f":"SUM(Kostnader4[Summa max])","v":{"v":87512088,"d":"87,512,088 "}},{"$f":"SUM(Kostnader4[Vägt medel])","v":{"v":72926740,"d":"72,926,740 "}},null,null,"Summa",{"$nulls":3},{"$f":"SUM(Kostnader[år 1])","v":{"v":2868500,"d":"2,868,500 "}},{"$f":"SUM(Kostnader[år 2])","v":{"v":1941747.572815534,"d":"1,941,748 "}},{"$f":"SUM(Kostnader[år 3])","v":{"v":15839796.399283627,"d":"15,839,796 "}},{"$f":"SUM(Kostnader[år 4])","v":{"v":9987123.956852902,"d":"9,987,124 "}},{"$f":"SUM(Kostnader[år 5])","v":{"v":9429690.73693879,"d":"9,429,691 "}},{"$f":"SUM(Kostnader[år 6])","v":{"v":9155039.55042601,"d":"9,155,040 "}},{"$f":"SUM(Kostnader[Summa])","v":{"v":49221898.21631686,"d":"49,221,898 "}},{"$f":"SUM(Kostnader[Min])","v":{"v":39377518.573053494,"d":"39,377,519 "}},{"$f":"SUM(Kostnader[Max])","v":{"v":59066277.85958022,"d":"59,066,278 "}},{"$f":"SUM(Kostnader[Vägt medel])","v":{"v":49221898.21631686,"d":"49,221,898 "}}]
[]
[null,null,"Beräkning av ökat personalbehov - bild"]
[]
[]
[null,null,"Ärendetider "]
[{"$nulls":3},"Antal samtal","Medelärendetid"]
[null,null,"Invånarsamtal utan bild (hämtas från \"räkna på nyttorna\")",{"$f":"'Räkna på nyttorna'!F6-D36","v":0},{"v":8,"d":"8.0 "}]
[null,null,"Invånarsamtal med bild (hämtas från \"räkna på nyttorna\")",{"$f":"'Räkna på nyttorna'!F8","v":0},{"v":19,"d":"19.0 "}]
[null,null,"Medelärendetid för alla samtal när bild används i verksamheten",null,{"$f":"((E35*D35)+(E36*D36))/(D35+D36)","v":{"$error":"#DIV/0!"}}]
[]
[{"$nulls":3},"Antaganden i Erlang C"]
[{"$nulls":3},"Samtal per timme för de 16 regioner som planerar att införa video",480]
[{"$nulls":3},"75 % ska besvaras inom 15 minuter (900 sek)"]
[{"$nulls":3},"Medelärendetid med bild",{"$f":"E37","v":{"$error":"#DIV/0!"}}]
[{"$nulls":3},"Medelärendetid utan bild",{"$f":"E35","v":{"v":8,"d":"8.0 "}}]
[]
[{"$nulls":3},"Medelärendetid i sek"]
[null,null,"Antal sjuksköterskor som behövs per timme",{"$f":"E37*60","v":{"$error":"#DIV/0!"}},118]
[null,null,"Antal sjuksköterskor som behövs per timme ",{"$f":"8*60","v":480},109]
[null,null,"Antal extra sjuksköterskor som behövs per timme",null,{"$f":"E46-E47","v":9}]
[]
[null,null,"Årskostnad för sjuksköterska",{"v":606800,"d":"606,800 "}]
[null,null,"Årskostnad för alla extra sjuksköterskor som behövs",{"$f":"D50*E48","v":{"v":5461200,"d":"5,461,200 "}}]
[]
[]
[null,null,"Beräkning av ökat personalbehov - video"]
[]
[]
[null,null,"Ärendetider"]
[{"$nulls":3},"Antal samtal","Medelärendetid"]
[null,null,"Invånarsamtal utan video (hämtas från \"räkna på nyttorna\")",{"$f":"'Räkna på nyttorna'!F57-D60","v":{"v":2261552.61,"d":"2,261,553 "}},{"v":8,"d":"8.0 "}]
[null,null,"Invånarsamtal med video (hämtas från \"räkna på nyttorna\")",{"$f":"'Räkna på nyttorna'!F59","v":{"v":170224.39,"d":"170,224 "}},{"v":18,"d":"18.0 "}]
[null,null,"Medelärendetid för alla samtal när video används i verksamheten",null,{"$f":"((E59*D59)+(E60*D60))/(D59+D60)","v":{"v":8.7,"d":"8.7 "}}]
[]
[{"$nulls":3},"Antaganden i Erlang C"]
[{"$nulls":3},"Samtal per timme för de 16 regioner som planerar att införa video",431]
[{"$nulls":3},"75 % ska besvaras inom 15 minuter (900 sek)"]
[{"$nulls":3},"Medelärendetid när vissa samtal sker med video",{"$f":"E61","v":{"v":8.7,"d":"8.7 "}}]
[{"$nulls":3},"Medelärendetid utan video",{"$f":"E59","v":{"v":8,"d":"8.0 "}}]
[]
[null,null,"Antal sjuksköterskor som behövs per timme",{"$f":"E61*60","v":{"v":522,"d":"522.0 "}},106]
[null,null,"Antal sjuksköterskor som behövs per ",480,97]
[null,null,"Antal extra sjuksköterskor som behövs per timme",null,{"$f":"E69-E70","v":9}]
[]
[null,null,"Årskostnad för sjuksköterska",{"v":606800,"d":"606,800 "}]
[null,null,"Årskostnad för alla extra sjuksköterskor som behövs",{"$f":"D73*E71","v":{"v":5461200,"d":"5,461,200 "}}]
[]
[]
[null,null,"Beräkningen för utbildning: "]
[null,null,"Först utbildas  2 sjuksköterskor per region i 2 heldagar. För VGR är det istället 10."]
[{"$nulls":3},"Regioner","Ssk per region","Summa ssk","Plus 10 ssk från VGR","Total summa ssk","Antal timmar","Totalt antal timmar","Pris per timme","Kostnad"]
[null,null,"Bild",18,2,{"$f":"E80*D80","v":36},10,{"$f":"G80+F80","v":46},16,{"$f":"I80*H80","v":736},380,{"$f":"K80*J80","v":{"v":279680,"d":"279,680 "}}]
[null,null,"Video",15,2,{"$f":"E81*D81","v":30},10,{"$f":"G81+F81","v":40},16,{"$f":"I81*H81","v":640},380,{"$f":"K81*J81","v":{"v":243200,"d":"243,200 "}}]
[]
[]
[]
[null,null,"Sedan utbildar de övriga sjuksköterskor i 1 heldag. Vi antar att alla utbildas. Vi räknar bara med de regioner som planerar att införa tjänsten:"]
[{"$nulls":3},"Antal som ska utbildas (baseras på unika användare i RGS för regionerna)","Antal timmar","Timpris","Kostnad"]
[null,null,"Bild - 19 regioner",868,8,380,{"$f":"D87*E87*F87","v":{"v":2638720,"d":"2,638,720 "}}]
[null,null,"Video - 16 regioner",816,8,380,{"$f":"D88*E88*F88","v":{"v":2480640,"d":"2,480,640 "}}]
[]
[]
[null,null,"Och sedan utbildas 50 nya per år (antagande om personalomsättning)"]
[{"$nulls":3},"Antal som ska utbildas","Antal timmar","Timpris","Kostnad"]
[null,null,"Bild",50,8,380,{"$f":"D93*E93*F93","v":{"v":152000,"d":"152,000 "}}]
[null,null,"Video",50,8,380,{"$f":"D94*E94*F94","v":{"v":152000,"d":"152,000 "}}]

{"sheet":"Nyttokalkyl","index":4,"n_rows":123,"n_cols":15,"rows_kept":123,"merged":[[8,2,8,3],[20,2,22,3],[59,2,59,3],[110,2,110,3]]}
[null,null,"Nyttokalkyl"]
[null,null,{"$f":"IF(Försättsblad!B6=0,\"\",Försättsblad!B6)","v":"Första linjens digitala vård - nya kanaler - video"}]
[null,null,"Tabellerna och diagrammen är formaterade för att passa i powerpoint-presentationer. "]
[null,null,"Markera och kopiera tabellen eller diagrammet och välj att \"klistra in som bild\" för ett snyggt resultat."]
[]
[null,null,"Total nytta"]
[]
[]
[null,null,"Nyttorealiseringskalkyl - total nytta",{"$nulls":4},"Nyttorealiseringskalkyl - total nytta"]
[null,null,"För perioden",{"$f":"Startår & \" - \" & Startår+5","v":"2019 - 2024"}]
[{"$nulls":8},{"$f":"Startår","v":2019},{"$f":"I11+1","v":2020},{"$f":"J11+1","v":2021},2022,{"$f":"L11+1","v":2023},{"$f":"M11+1","v":2024},"Totalt"]
[null,null,"Total kostnad",{"$f":"TotalKostnad","v":{"v":-49221898.216316864,"d":"-49,221,898 kr"}},{"$nulls":3},"Total nytta",{"$f":"I13+I14","v":0},{"$f":"J13+J14","v":0},{"v":5191691.464827033,"d":"5,191,691 "},{"v":15121431.45095252,"d":"15,121,431 "},{"v":44043004.22607531,"d":"44,043,004 "},{"v":42760198.27774302,"d":"42,760,198 "},{"v":107116325.41959788,"d":"107,116,325 "}]
[null,null,"Finansiell nytta",{"$f":"O13","v":{"v":9683224.448018909,"d":"9,683,224 kr"}},{"$nulls":3},"Finansiella nyttor",{"$f":"IFERROR(GETPIVOTDATA(\"Summa av år 1\",'-Admin-'!$C$25,\"Nyttokategori\",\"1. Finansiell\"),0)","v":0},{"$f":"IFERROR(GETPIVOTDATA(\"Summa av år 2\",'-Admin-'!$C$25,\"Nyttokategori\",\"1. Finansiell\"),0)","v":0},{"$f":"IFERROR(GETPIVOTDATA(\"Summa av år 3\",'-Admin-'!$C$25,\"Nyttokategori\",\"1. Finansiell\"),0)","v":{"v":469324.47992270696,"d":"469,324 "}},{"$f":"IFERROR(GETPIVOTDATA(\"Summa av år 4\",'-Admin-'!$C$25,\"Nyttokategori\",\"1. Finansiell\"),0)","v":{"v":1366964.5046292434,"d":"1,366,965 "}},{"$f":"IFERROR(GETPIVOTDATA(\"Summa av år 5\",'-Admin-'!$C$25,\"Nyttokategori\",\"1. Finansiell\"),0)","v":{"v":3981450.013483234,"d":"3,981,450 "}},{"$f":"IFERROR(GETPIVOTDATA(\"Summa av år 6\",'-Admin-'!$C$25,\"Nyttokategori\",\"1. Finansiell\"),0)","v":{"v":3865485.4499837225,"d":"3,865,485 "}},{"$f":"SUM(I13:N13)","v":{"v":9683224.448018909,"d":"9,683,224 "}}]
[null,null,"Omfördelningsnytta",{"$f":"O14","v":{"v":97433100.97157897,"d":"97,433,101 kr"}},{"$nulls":3},"Omfördelningsnyttor",{"$f":"IFERROR(GETPIVOTDATA(\"Summa av år 1\",'-Admin-'!$C$25,\"Nyttokategori\",\"2. Omfördelningsnytta\"),0)","v":0},{"$f":"IFERROR(GETPIVOTDATA(\"Summa av år 2\",'-Admin-'!$C$25,\"Nyttokategori\",\"2. Omfördelningsnytta\"),0)","v":0},{"$f":"IFERROR(GETPIVOTDATA(\"Summa av år 3\",'-Admin-'!$C$25,\"Nyttokategori\",\"2. Omfördelningsnytta\"),0)","v":{"v":4722366.984904326,"d":"4,722,367 "}},{"$f":"IFERROR(GETPIVOTDATA(\"Summa av år 4\",'-Admin-'!$C$25,\"Nyttokategori\",\"2. Omfördelningsnytta\"),0)","v":{"v":13754466.946323277,"d":"13,754,467 "}},{"$f":"IFERROR(GETPIVOTDATA(\"Summa av år 5\",'-Admin-'!$C$25,\"Nyttokategori\",\"2. Omfördelningsnytta\"),0)","v":{"v":40061554.21259207,"d":"40,061,554 "}},{"$f":"IFERROR(GETPIVOTDATA(\"Summa av år 6\",'-Admin-'!$C$25,\"Nyttokategori\",\"2. Omfördelningsnytta\"),0)","v":{"v":38894712.827759296,"d":"38,894,713 "}},{"$f":"SUM(I14:N14)","v":{"v":97433100.97157897,"d":"97,433,101 "}}]
[null,null,"Total nytta",{"$f":"TotalNytta","v":{"v":107116325.41959788,"d":"107,116,325 kr"}}]
[null,null,"Total nettonytta",{"$f":"NettoNytta","v":{"v":57894427.203281015,"d":"57,894,427 kr"}},{"$nulls":3},"Total kostnad",{"$f":"SUM(I17:I20)","v":{"v":-2868500,"d":"-2,868,500 "}},{"$f":"SUM(J17:J20)","v":{"v":-1941747.572815534,"d":"-1,941,748 "}},{"v":-15839796.399283629,"d":"-15,839,796 "},{"v":-9987123.9568529,"d":"-9,987,124 "},{"v":-9429690.73693879,"d":"-9,429,691 "},{"v":-9155039.55042601,"d":"-9,155,040 "},{"v":-49221898.216316864,"d":"-49,221,898 "}]
[{"$nulls":7},"Verksamhets-förändring",{"$f":"IFERROR(-GETPIVOTDATA(\"Summa av År 1\",'-Admin-'!$C$32,\"Kostnadskategori\",\"1. Verksamhetsförändring\"),0)","v":0},{"$f":"IFERROR(-GETPIVOTDATA(\"Summa av År 2\",'-Admin-'!$C$32,\"Kostnadskategori\",\"1. Verksamhetsförändring\"),0)","v":0},{"$f":"IFERROR(-GETPIVOTDATA(\"Summa av År 3\",'-Admin-'!$C$32,\"Kostnadskategori\",\"1. Verksamhetsförändring\"),0)","v":{"v":-329908.56819681404,"d":"-329,909 "}},{"$f":"IFERROR(-GETPIVOTDATA(\"Summa av År 4\",'-Admin-'!$C$32,\"Kostnadskategori\",\"1. Verksamhetsförändring\"),0)","v":{"v":-274542.49780594785,"d":"-274,542 "}},{"$f":"IFERROR(-GETPIVOTDATA(\"Summa av År 5\",'-Admin-'!$C$32,\"Kostnadskategori\",\"1. Verksamhetsförändring\"),0)","v":0},{"$f":"IFERROR(-GETPIVOTDATA(\"Summa av År 6\",'-Admin-'!$C$32,\"Kostnadskategori\",\"1. Verksamhetsförändring\"),0)","v":0},{"$f":"SUM(I17:N17)","v":{"v":-604451.066002762,"d":"-604,451 "}}]
[null,null,"Return on investment (ROI)",{"$f":"IF(-TotalKostnad=0,0,TotalNettoNytta/-TotalKostnad)","v":{"v":1.1761924936102777,"d":"1.18 kr"}},{"$nulls":3},"Löpande verksamhets-kostnader",{"$f":"IFERROR(-GETPIVOTDATA(\"Summa av År 1\",'-Admin-'!$C$32,\"Kostnadskategori\",\"2. Löpande verksamhetskostnader\"),0)","v":0},{"$f":"IFERROR(-GETPIVOTDATA(\"Summa av År 2\",'-Admin-'!$C$32,\"Kostnadskategori\",\"2. Löpande verksamhetskostnader\"),0)","v":0},{"$f":"IFERROR(-GETPIVOTDATA(\"Summa av År 3\",'-Admin-'!$C$32,\"Kostnadskategori\",\"2. Löpande verksamhetskostnader\"),0)","v":{"v":-11739504.194551796,"d":"-11,739,504 "}},{"$f":"IFERROR(-GETPIVOTDATA(\"Summa av År 4\",'-Admin-'!$C$32,\"Kostnadskategori\",\"2. Löpande verksamhetskostnader\"),0)","v":{"v":-9712581.459046952,"d":"-9,712,581 "}},{"$f":"IFERROR(-GETPIVOTDATA(\"Summa av År 5\",'-Admin-'!$C$32,\"Kostnadskategori\",\"2. Löpande verksamhetskostnader\"),0)","v":{"v":-9429690.73693879,"d":"-9,429,691 "}},{"$f":"IFERROR(-GETPIVOTDATA(\"Summa av År 6\",'-Admin-'!$C$32,\"Kostnadskategori\",\"2. Löpande verksamhetskostnader\"),0)","v":{"v":-9155039.55042601,"d":"-9,155,040 "}},{"$f":"SUM(I18:N18)","v":{"v":-40036815.94096355,"d":"-40,036,816 "}}]
[null,null,"Payback-år",{"$f":"IF('-Admin-'!D103=0,\"Ingen payback\",'-Admin-'!D103)","v":2023},{"$nulls":3},"Investeringar",{"$f":"IFERROR(-GETPIVOTDATA(\"Summa av År 1\",'-Admin-'!$C$32,\"Kostnadskategori\",\"3. Investeringar\"),0)","v":0},{"$f":"IFERROR(-GETPIVOTDATA(\"Summa av År 2\",'-Admin-'!$C$32,\"Kostnadskategori\",\"3. Investeringar\"),0)","v":0},{"$f":"IFERROR(-GETPIVOTDATA(\"Summa av År 3\",'-Admin-'!$C$32,\"Kostnadskategori\",\"3. Investeringar\"),0)","v":0},{"$f":"IFERROR(-GETPIVOTDATA(\"Summa av År 4\",'-Admin-'!$C$32,\"Kostnadskategori\",\"3. Investeringar\"),0)","v":0},{"$f":"IFERROR(-GETPIVOTDATA(\"Summa av År 5\",'-Admin-'!$C$32,\"Kostnadskategori\",\"3. Investeringar\"),0)","v":0},{"$f":"IFERROR(-GETPIVOTDATA(\"Summa av År 6\",'-Admin-'!$C$32,\"Kostnadskategori\",\"3. Investeringar\"),0)","v":0},{"$f":"SUM(I19:N19)","v":0}]
[{"$nulls":7},"Projekt",{"$f":"IFERROR(-GETPIVOTDATA(\"Summa av År 1\",'-Admin-'!$C$32,\"Kostnadskategori\",\"4. Projekt\"),0)","v":{"v":-2868500,"d":"-2,868,500 "}},{"$f":"IFERROR(-GETPIVOTDATA(\"Summa av År 2\",'-Admin-'!$C$32,\"Kostnadskategori\",\"4. Projekt\"),0)","v":{"v":-1941747.572815534,"d":"-1,941,748 "}},{"$f":"IFERROR(-GETPIVOTDATA(\"Summa av År 3\",'-Admin-'!$C$32,\"Kostnadskategori\",\"4. Projekt\"),0)","v":{"v":-3770383.6365350178,"d":"-3,770,384 "}},{"$f":"IFERROR(-GETPIVOTDATA(\"Summa av År 4\",'-Admin-'!$C$32,\"Kostnadskategori\",\"4. Projekt\"),0)","v":0},{"$f":"IFERROR(-GETPIVOTDATA(\"Summa av År 5\",'-Admin-'!$C$32,\"Kostnadskategori\",\"4. Projekt\"),0)","v":0},{"$f":"IFERROR(-GETPIVOTDATA(\"Summa av År 6\",'-Admin-'!$C$32,\"Kostnadskategori\",\"4. Projekt\"),0)","v":0},{"v":-8580631.209350552,"d":"-8,580,631 "}]
[null,null,"Return on investment (ROI) är intjänad värderad nytta per investerad krona. \nPayback-år är året då de värderade nyttorna förväntas överstiga kostnaderna. "]
[{"$nulls":7},"Finansiell nettonytta",{"$f":"I13+I16","v":{"v":-2868500,"d":"-2,868,500 "}},{"$f":"J13+J16","v":{"v":-1941747.572815534,"d":"-1,941,748 "}},{"v":-15370471.919360923,"d":"-15,370,472 "},{"v":-8620159.452223657,"d":"-8,620,159 "},{"v":-5448240.723455556,"d":"-5,448,241 "},{"v":-5289554.1004422875,"d":"-5,289,554 "},{"$f":"O13+O16","v":{"v":-39538673.768297955,"d":"-39,538,674 "}}]
[{"$nulls":7},"Ackumulerad finansiell nettonytta",{"$f":"I14+I16","v":{"v":-2868500,"d":"-2,868,500 "}},{"$f":"IF(J22=0,I23,I23+J22)","v":{"v":-4810247.572815534,"d":"-4,810,248 "}},{"$f":"IF(K22=0,J23,J23+K22)","v":{"v":-20180719.49217646,"d":"-20,180,719 "}},{"$f":"IF(L22=0,K23,K23+L22)","v":{"v":-28800878.944400117,"d":"-28,800,879 "}},{"$f":"IF(M22=0,L23,L23+M22)","v":{"v":-34249119.66785567,"d":"-34,249,120 "}},{"$f":"IF(N22=0,M23,M23+N22)","v":{"v":-39538673.76829796,"d":"-39,538,674 "}},{"$f":"N23","v":{"v":-39538673.76829796,"d":"-39,538,674 "}}]
[{"$nulls":7},"Omfördelnings-nettonytta",{"$f":"I14+I16","v":{"v":-2868500,"d":"-2,868,500 "}},{"$f":"J14+J16","v":{"v":-1941747.572815534,"d":"-1,941,748 "}},{"v":-11117429.414379302,"d":"-11,117,429 "},{"v":3767342.9894703776,"d":"3,767,343 "},{"v":30631863.475653283,"d":"30,631,863 "},{"v":29739673.277333286,"d":"29,739,673 "},{"$f":"O14+O16","v":{"v":48211202.75526211,"d":"48,211,203 "}}]
[{"$nulls":7},"Ackumulerad omfördelnings-nettonytta",{"$f":"I26","v":{"v":-2868500,"d":"-2,868,500 "}},{"$f":"IF(J24=0,I25,I25+J24)","v":{"v":-4810247.572815534,"d":"-4,810,248 "}},{"$f":"IF(K24=0,J25,J25+K24)","v":{"v":-15927676.987194836,"d":"-15,927,677 "}},{"$f":"IF(L24=0,K25,K25+L24)","v":{"v":-12160333.997724459,"d":"-12,160,334 "}},{"$f":"IF(M24=0,L25,L25+M24)","v":{"v":18471529.477928825,"d":"18,471,529 "}},{"$f":"IF(N24=0,M25,M25+N24)","v":{"v":48211202.75526211,"d":"48,211,203 "}},{"$f":"N25","v":{"v":48211202.75526211,"d":"48,211,203 "}}]
[{"$nulls":7},"Nettonytta",{"$f":"I12+I16","v":{"v":-2868500,"d":"-2,868,500 "}},{"$f":"J12+J16","v":{"v":-1941747.572815534,"d":"-1,941,748 "}},{"v":-10648104.934456596,"d":"-10,648,105 "},{"$f":"L12+L16","v":{"v":5134307.494099621,"d":"5,134,307 "}},{"$f":"M12+M16","v":{"v":34613313.48913652,"d":"34,613,313 "}},{"v":33605158.727317005,"d":"33,605,159 "},{"$f":"O12+O16","v":{"v":57894427.203281015,"d":"57,894,427 "}}]
[{"$nulls":7},"Ackumulerad nettonytta",{"$f":"I26","v":{"v":-2868500,"d":"-2,868,500 "}},{"$f":"IF(J26=0,I27,I27+J26)","v":{"v":-4810247.572815534,"d":"-4,810,248 "}},{"$f":"IF(K26=0,J27,J27+K26)","v":{"v":-15458352.50727213,"d":"-15,458,353 "}},{"$f":"IF(L26=0,K27,K27+L26)","v":{"v":-10324045.01317251,"d":"-10,324,045 "}},{"$f":"IF(M26=0,L27,L27+M26)","v":{"v":24289268.47596401,"d":"24,289,268 "}},{"$f":"IF(N26=0,M27,M27+N26)","v":{"v":57894427.203281015,"d":"57,894,427 "}},{"$f":"N27","v":{"v":57894427.203281015,"d":"57,894,427 "}}]
{"$rows_empty":29}
[null,null,"Finansiell nytta"]
[]
[]
[null,null,"Nyttorealiseringskalkyl - finansiel nytta",{"$nulls":4},"Nyttorealiseringskalkyl - finansiell nytta"]
[null,null,"För perioden",{"$f":"Startår & \" - \" & Startår+5","v":"2019 - 2024"}]
[{"$nulls":8},{"$f":"Startår","v":2019},{"$f":"I62+1","v":2020},{"$f":"J62+1","v":2021},{"$f":"K62+1","v":2022},{"$f":"L62+1","v":2023},{"$f":"M62+1","v":2024},"Totalt"]
[null,null,"Total kostnad",{"$f":"TotalKostnad","v":{"v":-49221898.216316864,"d":"-49,221,898 kr"}},{"$nulls":3},"Finansiella nyttor",{"$f":"IFERROR(GETPIVOTDATA(\"Summa av år 1\",'-Admin-'!$C$25,\"Nyttokategori\",\"1. Finansiell\"),0)","v":0},{"$f":"IFERROR(GETPIVOTDATA(\"Summa av år 2\",'-Admin-'!$C$25,\"Nyttokategori\",\"1. Finansiell\"),0)","v":0},{"$f":"IFERROR(GETPIVOTDATA(\"Summa av år 3\",'-Admin-'!$C$25,\"Nyttokategori\",\"1. Finansiell\"),0)","v":{"v":469324.47992270696,"d":"469,324 "}},{"$f":"IFERROR(GETPIVOTDATA(\"Summa av år 4\",'-Admin-'!$C$25,\"Nyttokategori\",\"1. Finansiell\"),0)","v":{"v":1366964.5046292434,"d":"1,366,965 "}},{"$f":"IFERROR(GETPIVOTDATA(\"Summa av år 5\",'-Admin-'!$C$25,\"Nyttokategori\",\"1. Finansiell\"),0)","v":{"v":3981450.013483234,"d":"3,981,450 "}},{"$f":"IFERROR(GETPIVOTDATA(\"Summa av år 6\",'-Admin-'!$C$25,\"Nyttokategori\",\"1. Finansiell\"),0)","v":{"v":3865485.4499837225,"d":"3,865,485 "}},{"$f":"SUM(I63:N63)","v":{"v":9683224.448018909,"d":"9,683,224 "}}]
[null,null,"Total finansiell nytta",{"$f":"O63","v":{"v":9683224.448018909,"d":"9,683,224 kr"}}]
[null,null,"Finansiell nettonytta",{"$f":"O71","v":{"v":-39538673.768297955,"d":"-39,538,674 kr"}},{"$nulls":3},"Total kostnad",{"$f":"SUM(I66:I69)","v":{"v":-2868500,"d":"-2,868,500 "}},{"$f":"SUM(J66:J69)","v":{"v":-1941747.572815534,"d":"-1,941,748 "}},{"v":-15839796.399283629,"d":"-15,839,796 "},{"v":-9987123.9568529,"d":"-9,987,124 "},{"v":-9429690.73693879,"d":"-9,429,691 "},{"v":-9155039.55042601,"d":"-9,155,040 "},{"v":-49221898.216316864,"d":"-49,221,898 "}]
[{"$nulls":7},"Verksamhets-förändring",{"$f":"IFERROR(-GETPIVOTDATA(\"Summa av År 1\",'-Admin-'!$C$32,\"Kostnadskategori\",\"1. Verksamhetsförändring\"),0)","v":0},{"$f":"IFERROR(-GETPIVOTDATA(\"Summa av År 2\",'-Admin-'!$C$32,\"Kostnadskategori\",\"1. Verksamhetsförändring\"),0)","v":0},{"$f":"IFERROR(-GETPIVOTDATA(\"Summa av År 3\",'-Admin-'!$C$32,\"Kostnadskategori\",\"1. Verksamhetsförändring\"),0)","v":{"v":-329908.56819681404,"d":"-329,909 "}},{"$f":"IFERROR(-GETPIVOTDATA(\"Summa av År 4\",'-Admin-'!$C$32,\"Kostnadskategori\",\"1. Verksamhetsförändring\"),0)","v":{"v":-274542.49780594785,"d":"-274,542 "}},{"$f":"IFERROR(-GETPIVOTDATA(\"Summa av År 5\",'-Admin-'!$C$32,\"Kostnadskategori\",\"1. Verksamhetsförändring\"),0)","v":0},{"$f":"IFERROR(-GETPIVOTDATA(\"Summa av År 6\",'-Admin-'!$C$32,\"Kostnadskategori\",\"1. Verksamhetsförändring\"),0)","v":0},{"$f":"SUM(I66:N66)","v":{"v":-604451.066002762,"d":"-604,451 "}}]
[null,null,"Return on investment (ROI)",{"$f":"IF(-O65=0,0,O71/-O65)","v":{"v":-0.8032740548634721,"d":"-0.80 kr"}},{"$nulls":3},"Löpande verksamhets-kostnader",{"$f":"IFERROR(-GETPIVOTDATA(\"Summa av År 1\",'-Admin-'!$C$32,\"Kostnadskategori\",\"2. Löpande verksamhetskostnader\"),0)","v":0},{"$f":"IFERROR(-GETPIVOTDATA(\"Summa av År 2\",'-Admin-'!$C$32,\"Kostnadskategori\",\"2. Löpande verksamhetskostnader\"),0)","v":0},{"$f":"IFERROR(-GETPIVOTDATA(\"Summa av År 3\",'-Admin-'!$C$32,\"Kostnadskategori\",\"2. Löpande verksamhetskostnader\"),0)","v":{"v":-11739504.194551796,"d":"-11,739,504 "}},{"$f":"IFERROR(-GETPIVOTDATA(\"Summa av År 4\",'-Admin-'!$C$32,\"Kostnadskategori\",\"2. Löpande verksamhetskostnader\"),0)","v":{"v":-9712581.459046952,"d":"-9,712,581 "}},{"$f":"IFERROR(-GETPIVOTDATA(\"Summa av År 5\",'-Admin-'!$C$32,\"Kostnadskategori\",\"2. Löpande verksamhetskostnader\"),0)","v":{"v":-9429690.73693879,"d":"-9,429,691 "}},{"$f":"IFERROR(-GETPIVOTDATA(\"Summa av År 6\",'-Admin-'!$C$32,\"Kostnadskategori\",\"2. Löpande verksamhetskostnader\"),0)","v":{"v":-9155039.55042601,"d":"-9,155,040 "}},{"$f":"SUM(I67:N67)","v":{"v":-40036815.94096355,"d":"-40,036,816 "}}]
[null,null,"Payback-år",{"$f":"'-Admin-'!D112","v":"Ingen payback"},{"$nulls":3},"Investeringar",{"$f":"IFERROR(-GETPIVOTDATA(\"Summa av År 1\",'-Admin-'!$C$32,\"Kostnadskategori\",\"3. Investeringar\"),0)","v":0},{"$f":"IFERROR(-GETPIVOTDATA(\"Summa av År 2\",'-Admin-'!$C$32,\"Kostnadskategori\",\"3. Investeringar\"),0)","v":0},{"$f":"IFERROR(-GETPIVOTDATA(\"Summa av År 3\",'-Admin-'!$C$32,\"Kostnadskategori\",\"3. Investeringar\"),0)","v":0},{"$f":"IFERROR(-GETPIVOTDATA(\"Summa av År 4\",'-Admin-'!$C$32,\"Kostnadskategori\",\"3. Investeringar\"),0)","v":0},{"$f":"IFERROR(-GETPIVOTDATA(\"Summa av År 5\",'-Admin-'!$C$32,\"Kostnadskategori\",\"3. Investeringar\"),0)","v":0},{"$f":"IFERROR(-GETPIVOTDATA(\"Summa av År 6\",'-Admin-'!$C$32,\"Kostnadskategori\",\"3. Investeringar\"),0)","v":0},{"$f":"SUM(I68:N68)","v":0}]
[{"$nulls":7},"Projekt",{"$f":"IFERROR(-GETPIVOTDATA(\"Summa av År 1\",'-Admin-'!$C$32,\"Kostnadskategori\",\"4. Projekt\"),0)","v":{"v":-2868500,"d":"-2,868,500 "}},{"$f":"IFERROR(-GETPIVOTDATA(\"Summa av År 2\",'-Admin-'!$C$32,\"Kostnadskategori\",\"4. Projekt\"),0)","v":{"v":-1941747.572815534,"d":"-1,941,748 "}},{"$f":"IFERROR(-GETPIVOTDATA(\"Summa av År 3\",'-Admin-'!$C$32,\"Kostnadskategori\",\"4. Projekt\"),0)","v":{"v":-3770383.6365350178,"d":"-3,770,384 "}},{"$f":"IFERROR(-GETPIVOTDATA(\"Summa av År 4\",'-Admin-'!$C$32,\"Kostnadskategori\",\"4. Projekt\"),0)","v":0},{"$f":"IFERROR(-GETPIVOTDATA(\"Summa av År 5\",'-Admin-'!$C$32,\"Kostnadskategori\",\"4. Projekt\"),0)","v":0},{"$f":"IFERROR(-GETPIVOTDATA(\"Summa av År 6\",'-Admin-'!$C$32,\"Kostnadskategori\",\"4. Projekt\"),0)","v":0},{"v":-8580631.209350552,"d":"-8,580,631 "}]
[]
[{"$nulls":7},"Finansiell nettonytta",{"$f":"I63+I65","v":{"v":-2868500,"d":"-2,868,500 "}},{"v":-1941747.572815534,"d":"-1,941,748 "},{"v":-15370471.919360923,"d":"-15,370,472 "},{"$f":"L63+L65","v":{"v":-8620159.452223657,"d":"-8,620,159 "}},{"v":-5448240.723455556,"d":"-5,448,241 "},{"v":-5289554.1004422875,"d":"-5,289,554 "},{"$f":"O63+O65","v":{"v":-39538673.768297955,"d":"-39,538,674 "}}]
[{"$nulls":7},"Ackumulerad finansiell nettonytta",{"$f":"I63+I65","v":{"v":-2868500,"d":"-2,868,500 "}},{"$f":"IF(J71=0,I72,I72+J71)","v":{"v":-4810247.572815534,"d":"-4,810,248 "}},{"$f":"IF(K71=0,J72,J72+K71)","v":{"v":-20180719.49217646,"d":"-20,180,719 "}},{"$f":"IF(L71=0,K72,K72+L71)","v":{"v":-28800878.944400117,"d":"-28,800,879 "}},{"$f":"IF(M71=0,L72,L72+M71)","v":{"v":-34249119.66785567,"d":"-34,249,120 "}},{"$f":"IF(N71=0,M72,M72+N71)","v":{"v":-39538673.76829796,"d":"-39,538,674 "}},{"$f":"N72","v":{"v":-39538673.76829796,"d":"-39,538,674 "}}]
{"$rows_empty":35}
[null,null,"Omfördelningsnytta"]
[]
[]
[null,null,"Nyttorealiseringskalkyl - omfördelningsnytta",{"$nulls":4},"Nyttorealiseringskalkyl per år"]
[null,null,"För perioden",{"$f":"Startår & \" - \" & Startår+5","v":"2019 - 2024"}]
[{"$nulls":8},{"$f":"Startår","v":2019},{"$f":"I113+1","v":2020},{"$f":"J113+1","v":2021},{"$f":"K113+1","v":2022},{"$f":"L113+1","v":2023},{"$f":"M113+1","v":2024},"Totalt"]
[null,null,"Total kostnad",{"$f":"TotalKostnad","v":{"v":-49221898.216316864,"d":"-49,221,898 "}},{"$nulls":3},"Omfördelningsnyttor",{"$f":"IFERROR(GETPIVOTDATA(\"Summa av år 1\",'-Admin-'!$C$25,\"Nyttokategori\",\"2. Omfördelningsnytta\"),0)","v":0},{"$f":"IFERROR(GETPIVOTDATA(\"Summa av år 2\",'-Admin-'!$C$25,\"Nyttokategori\",\"2. Omfördelningsnytta\"),0)","v":0},{"$f":"IFERROR(GETPIVOTDATA(\"Summa av år 3\",'-Admin-'!$C$25,\"Nyttokategori\",\"2. Omfördelningsnytta\"),0)","v":{"v":4722366.984904326,"d":"4,722,367 "}},{"$f":"IFERROR(GETPIVOTDATA(\"Summa av år 4\",'-Admin-'!$C$25,\"Nyttokategori\",\"2. Omfördelningsnytta\"),0)","v":{"v":13754466.946323277,"d":"13,754,467 "}},{"$f":"IFERROR(GETPIVOTDATA(\"Summa av år 5\",'-Admin-'!$C$25,\"Nyttokategori\",\"2. Omfördelningsnytta\"),0)","v":{"v":40061554.21259207,"d":"40,061,554 "}},{"$f":"IFERROR(GETPIVOTDATA(\"Summa av år 6\",'-Admin-'!$C$25,\"Nyttokategori\",\"2. Omfördelningsnytta\"),0)","v":{"v":38894712.827759296,"d":"38,894,713 "}},{"$f":"SUM(I114:N114)","v":{"v":97433100.97157897,"d":"97,433,101 "}}]
[null,null,"Total omfördelningsnytta",{"$f":"O114","v":{"v":97433100.97157897,"d":"97,433,101 "}}]
[null,null,"Omfördelnings-nettonytta",{"$f":"O122","v":{"v":48211202.75526211,"d":"48,211,203 "}},{"$nulls":3},"Total kostnad",{"$f":"SUM(I117:I120)","v":{"v":-2868500,"d":"-2,868,500 "}},{"$f":"SUM(J117:J120)","v":{"v":-1941747.572815534,"d":"-1,941,748 "}},{"v":-15839796.399283629,"d":"-15,839,796 "},{"v":-9987123.9568529,"d":"-9,987,124 "},{"v":-9429690.73693879,"d":"-9,429,691 "},{"v":-9155039.55042601,"d":"-9,155,040 "},{"v":-49221898.216316864,"d":"-49,221,898 "}]
[{"$nulls":7},"Verksamhets-förändring",{"$f":"IFERROR(-GETPIVOTDATA(\"Summa av År 1\",'-Admin-'!$C$32,\"Kostnadskategori\",\"1. Verksamhetsförändring\"),0)","v":0},{"$f":"IFERROR(-GETPIVOTDATA(\"Summa av År 2\",'-Admin-'!$C$32,\"Kostnadskategori\",\"1. Verksamhetsförändring\"),0)","v":0},{"$f":"IFERROR(-GETPIVOTDATA(\"Summa av År 3\",'-Admin-'!$C$32,\"Kostnadskategori\",\"1. Verksamhetsförändring\"),0)","v":{"v":-329908.56819681404,"d":"-329,909 "}},{"$f":"IFERROR(-GETPIVOTDATA(\"Summa av År 4\",'-Admin-'!$C$32,\"Kostnadskategori\",\"1. Verksamhetsförändring\"),0)","v":{"v":-274542.49780594785,"d":"-274,542 "}},{"$f":"IFERROR(-GETPIVOTDATA(\"Summa av År 5\",'-Admin-'!$C$32,\"Kostnadskategori\",\"1. Verksamhetsförändring\"),0)","v":0},{"$f":"IFERROR(-GETPIVOTDATA(\"Summa av År 6\",'-Admin-'!$C$32,\"Kostnadskategori\",\"1. Verksamhetsförändring\"),0)","v":0},{"$f":"SUM(I117:N117)","v":{"v":-604451.066002762,"d":"-604,451 "}}]
[null,null,"Return on investment (ROI)",{"$f":"IF(-O116=0,0,O122/-O116)","v":{"v":0.9794665484737499,"d":"0.98 kr"}},{"$nulls":3},"Löpande verksamhets-kostnader",{"$f":"IFERROR(-GETPIVOTDATA(\"Summa av År 1\",'-Admin-'!$C$32,\"Kostnadskategori\",\"2. Löpande verksamhetskostnader\"),0)","v":0},{"$f":"IFERROR(-GETPIVOTDATA(\"Summa av År 2\",'-Admin-'!$C$32,\"Kostnadskategori\",\"2. Löpande verksamhetskostnader\"),0)","v":0},{"$f":"IFERROR(-GETPIVOTDATA(\"Summa av År 3\",'-Admin-'!$C$32,\"Kostnadskategori\",\"2. Löpande verksamhetskostnader\"),0)","v":{"v":-11739504.194551796,"d":"-11,739,504 "}},{"$f":"IFERROR(-GETPIVOTDATA(\"Summa av År 4\",'-Admin-'!$C$32,\"Kostnadskategori\",\"2. Löpande verksamhetskostnader\"),0)","v":{"v":-9712581.459046952,"d":"-9,712,581 "}},{"$f":"IFERROR(-GETPIVOTDATA(\"Summa av År 5\",'-Admin-'!$C$32,\"Kostnadskategori\",\"2. Löpande verksamhetskostnader\"),0)","v":{"v":-9429690.73693879,"d":"-9,429,691 "}},{"$f":"IFERROR(-GETPIVOTDATA(\"Summa av År 6\",'-Admin-'!$C$32,\"Kostnadskategori\",\"2. Löpande verksamhetskostnader\"),0)","v":{"v":-9155039.55042601,"d":"-9,155,040 "}},{"$f":"SUM(I118:N118)","v":{"v":-40036815.94096355,"d":"-40,036,816 "}}]
[null,null,"Payback-år",{"$f":"IF('-Admin-'!D119=0,\"Ingen payback\",'-Admin-'!D119)","v":2023},{"$nulls":3},"Investeringar",{"$f":"IFERROR(-GETPIVOTDATA(\"Summa av År 1\",'-Admin-'!$C$32,\"Kostnadskategori\",\"3. Investeringar\"),0)","v":0},{"$f":"IFERROR(-GETPIVOTDATA(\"Summa av År 2\",'-Admin-'!$C$32,\"Kostnadskategori\",\"3. Investeringar\"),0)","v":0},{"$f":"IFERROR(-GETPIVOTDATA(\"Summa av År 3\",'-Admin-'!$C$32,\"Kostnadskategori\",\"3. Investeringar\"),0)","v":0},{"$f":"IFERROR(-GETPIVOTDATA(\"Summa av År 4\",'-Admin-'!$C$32,\"Kostnadskategori\",\"3. Investeringar\"),0)","v":0},{"$f":"IFERROR(-GETPIVOTDATA(\"Summa av År 5\",'-Admin-'!$C$32,\"Kostnadskategori\",\"3. Investeringar\"),0)","v":0},{"$f":"IFERROR(-GETPIVOTDATA(\"Summa av År 6\",'-Admin-'!$C$32,\"Kostnadskategori\",\"3. Investeringar\"),0)","v":0},{"$f":"SUM(I119:N119)","v":0}]
[{"$nulls":7},"Projekt",{"$f":"IFERROR(-GETPIVOTDATA(\"Summa av År 1\",'-Admin-'!$C$32,\"Kostnadskategori\",\"4. Projekt\"),0)","v":{"v":-2868500,"d":"-2,868,500 "}},{"$f":"IFERROR(-GETPIVOTDATA(\"Summa av År 2\",'-Admin-'!$C$32,\"Kostnadskategori\",\"4. Projekt\"),0)","v":{"v":-1941747.572815534,"d":"-1,941,748 "}},{"$f":"IFERROR(-GETPIVOTDATA(\"Summa av År 3\",'-Admin-'!$C$32,\"Kostnadskategori\",\"4. Projekt\"),0)","v":{"v":-3770383.6365350178,"d":"-3,770,384 "}},{"$f":"IFERROR(-GETPIVOTDATA(\"Summa av År 4\",'-Admin-'!$C$32,\"Kostnadskategori\",\"4. Projekt\"),0)","v":0},{"$f":"IFERROR(-GETPIVOTDATA(\"Summa av År 5\",'-Admin-'!$C$32,\"Kostnadskategori\",\"4. Projekt\"),0)","v":0},{"$f":"IFERROR(-GETPIVOTDATA(\"Summa av År 6\",'-Admin-'!$C$32,\"Kostnadskategori\",\"4. Projekt\"),0)","v":0},{"v":-8580631.209350552,"d":"-8,580,631 "}]
[]
[{"$nulls":7},"Omfördelnings-nettonytta",{"$f":"I114+I116","v":{"v":-2868500,"d":"-2,868,500 "}},{"v":-1941747.572815534,"d":"-1,941,748 "},{"v":-11117429.414379302,"d":"-11,117,429 "},{"v":3767342.9894703776,"d":"3,767,343 "},{"v":30631863.475653283,"d":"30,631,863 "},{"v":29739673.277333286,"d":"29,739,673 "},{"v":48211202.75526211,"d":"48,211,203 "}]
[{"$nulls":7},"Ackumulerad omfördelnings-nettonytta",{"$f":"I124","v":0},{"$f":"IF(J122=0,I123,I123+J122)","v":{"v":-1941747.572815534,"d":"-1,941,748 "}},{"$f":"IF(K122=0,J123,J123+K122)","v":{"v":-13059176.987194836,"d":"-13,059,177 "}},{"$f":"IF(L122=0,K123,K123+L122)","v":{"v":-9291833.997724459,"d":"-9,291,834 "}},{"$f":"IF(M122=0,L123,L123+M122)","v":{"v":21340029.477928825,"d":"21,340,029 "}},{"$f":"IF(N122=0,M123,M123+N122)","v":{"v":51079702.75526211,"d":"51,079,703 "}},{"$f":"N123","v":{"v":51079702.75526211,"d":"51,079,703 "}}]

{"sheet":"Data antal samtal","index":5,"n_rows":23,"n_cols":5,"rows_kept":23,"merged":[[0,6,0,7]]}
["Planerat införande","Region","Besvarade samtal 2019 (Sörmland och Värmland från 2020)","5 % per månad -bild","5 % per månad -vide"]
["Bild","Blekinge",{"v":77367,"d":"77,367"},{"$f":"(C2*0.05)/12","v":{"v":322.3625,"d":"322 "}}]
["Bild och video","Dalarna",{"v":107767,"d":"107,767"},{"$f":"(C3*0.05)/12","v":{"v":449.0291666666667,"d":"449 "}},{"$f":"(C3*0.05)/12","v":{"v":449.0291666666667,"d":"449 "}}]
["Bild och video","Gotland",{"v":36251,"d":"36,251"},{"v":151.04583333333335,"d":"151 "},{"v":151.04583333333335,"d":"151 "}]
["Bild och video","Halland",{"v":89583,"d":"89,583"},{"v":373.26250000000005,"d":"373 "},{"v":373.26250000000005,"d":"373 "}]
["Bild och video","Jämtland",{"v":63539,"d":"63,539"},{"v":264.74583333333334,"d":"265 "},{"v":264.74583333333334,"d":"265 "}]
["Bild och video","Jönköpings län",{"v":124986,"d":"124,986"},{"v":520.775,"d":"521 "},{"v":520.775,"d":"521 "}]
["Bild och video","Kalmar län",{"v":78089,"d":"78,089"},{"v":325.37083333333334,"d":"325 "},{"v":325.37083333333334,"d":"325 "}]
["Bild och video","Kronoberg",{"v":91894,"d":"91,894"},{"v":382.89166666666665,"d":"383 "},{"v":382.89166666666665,"d":"383 "}]
["Bild","Norrbotten",{"v":88139,"d":"88,139"},{"v":367.24583333333334,"d":"367 "}]
["Bild och video","Skåne",{"v":302288,"d":"302,288"},{"v":1259.5333333333335,"d":"1,260 "},{"v":1259.5333333333335,"d":"1,260 "}]
["Bild och video","Sörmland (2020)",{"v":118561,"d":"118,561"},{"v":494.00416666666666,"d":"494 "},{"v":494.00416666666666,"d":"494 "}]
["Bild och video","Uppsala",{"v":147743,"d":"147,743"},{"v":615.5958333333334,"d":"616 "},{"v":615.5958333333334,"d":"616 "}]
["Bild och video","Värmland (2020",{"v":127382,"d":"127,382"},{"v":530.7583333333333,"d":"531 "},{"v":530.7583333333333,"d":"531 "}]
["Bild","Västerbotten",{"v":131098,"d":"131,098"},{"v":546.2416666666667,"d":"546 "}]
["Bild och video","Västernorrland",{"v":124424,"d":"124,424"},{"v":518.4333333333334,"d":"518 "},{"v":518.4333333333334,"d":"518 "}]
["Bild och video","Västmanland",{"v":118457,"d":"118,457"},{"v":493.5708333333334,"d":"494 "},{"v":493.5708333333334,"d":"494 "}]
["Bild och video","Västra Götaland",{"v":586408,"d":"586,408"},{"v":2443.366666666667,"d":"2,443 "},{"v":2443.366666666667,"d":"2,443 "}]
["Bild och video","Örebro län",{"v":127152,"d":"127,152"},{"v":529.8000000000001,"d":"530 "},{"v":529.8000000000001,"d":"530 "}]
["Bild och video","Östergötland",{"v":187253,"d":"187,253"},{"v":780.2208333333333,"d":"780 "},{"v":780.2208333333333,"d":"780 "}]
[]
[null,"Antal besvarade för regioner som inför bild",{"$f":"SUM(C2:C20)","v":{"v":2728381,"d":"2,728,381"}},{"$f":"SUM(D2:D20)","v":{"v":11368.254166666666,"d":"11,368"}},{"v":10132.404166666667,"d":"10,132"}]
[null,"Antal besvarade för regioner som inför video",{"$f":"SUM(C2:C20)-C10-C2-C15","v":{"v":2431777,"d":"2,431,777"}},{"$f":"SUM(D2:D20)-D10-D2-D15","v":{"v":10132.404166666667,"d":"10,132"}},{"v":10132.404166666667,"d":"10,132"}]

{"sheet":"-Admin-","index":6,"n_rows":120,"n_cols":13,"rows_kept":120,"hidden":true}
[null,null,"Admin"]
[null,null,"I den här fliken finns stödfunktioner som används i kalkylen. Redigera dem bara om du är säker på att du vill ändra hur mallen fungerar. "]
[]
[]
[null,null,"Underlag för rullister i mallen"]
[null,null,"Fördefinierade värden i rullisterna"]
[null,null,"Grunden för att kunna redovisa nyttokalkylen uppdelad på typ av nytta. "]
[]
[null,null,"Nyttokategori"]
[null,null,"1. Finansiell"]
[null,null,"2. Omfördelningsnytta"]
[null,null,"3. Kvalitativ, mätbar"]
[]
[null,null,"Kostnadskategori"]
[null,null,"1. Verksamhetsförändring"]
[null,null,"2. Löpande verksamhetskostnader"]
[null,null,"3. Investeringar"]
[null,null,"4. Projekt"]
[]
[]
[null,null,"Underlag för nyttokalkylen"]
[]
[null,null,"PivotNytta"]
[null,null,"Nyttor"]
[null,null,"Radetiketter","Summa av år 1","Summa av År 2","Summa av År 3","Summa av År 4","Summa av År 5","Summa av År 6"]
[null,null,"2. Omfördelningsnytta",0,0,{"v":4722366.984904326,"d":"4,722,367 "},{"v":13754466.946323277,"d":"13,754,467 "},{"v":40061554.21259207,"d":"40,061,554 "},{"v":38894712.827759296,"d":"38,894,713 "}]
[null,null,"1. Finansiell",0,0,{"v":469324.47992270696,"d":"469,324 "},{"v":1366964.5046292434,"d":"1,366,965 "},{"v":3981450.013483234,"d":"3,981,450 "},{"v":3865485.4499837225,"d":"3,865,485 "}]
[null,null,0,0,0,0,0,0,0]
[]
[null,null,"PivotKostnad"]
[null,null,"Kostnader"]
[null,null,"Radetiketter","Summa av År 1","Summa av År 2","Summa av År 3","Summa av År 4","Summa av År 5","Summa av År 6"]
[null,null,0,0,0,0,0,0,0]
[null,null,"2. Löpande verksamhetskostnader",0,0,{"v":11739504.194551796,"d":"11,739,504 "},{"v":9712581.459046952,"d":"9,712,581 "},{"v":9429690.73693879,"d":"9,429,691 "},{"v":9155039.55042601,"d":"9,155,040 "}]
[null,null,"1. Verksamhetsförändring",0,0,{"v":329908.56819681404,"d":"329,909 "},{"v":274542.49780594785,"d":"274,542 "},0,0]
[null,null,"4. Projekt",{"v":2868500,"d":"2,868,500 "},{"v":1941747.572815534,"d":"1,941,748 "},{"v":3770383.6365350178,"d":"3,770,384 "},0,0,0]
[]
[]
[]
[null,null,"Underlag för  några av diagrammen - övriga diagram hämtar sin data från sammanställningen på fliken Nyttokalkyl"]
[]
[null,null,"Diagram \"Nyttor och kostnader\""]
[]
[{"$nulls":3},"Finansiell nytta","Omfördelningsnytta","Total nytta","Kostnad"]
[null,null,"Nytta",{"$f":"Nyttokalkyl!$O$13","v":{"v":9683224.448018909,"d":"9,683,224 "}},{"$f":"Nyttokalkyl!O14","v":{"v":97433100.97157897,"d":"97,433,101 "}},{"$f":"D45+E45","v":{"v":107116325.41959788,"d":"107,116,325 "}}]
[null,null,"Kostnad",{"$nulls":3},{"$f":"-1*TotalKostnad","v":{"v":49221898.216316864,"d":"49,221,898 "}}]
[]
[null,null,"PivotNyttaIntressent",null,null,"PivotKostnadIntressent",null,null,"PivotFinansiellNyttaIntressent",null,null,"PivotOmfördelningsnyttaIntressent"]
[null,null,"Diagram \"Nytta per intressent\"",null,null,"Diagram \"Kostnad per intressent\"",null,null,"Diagram \"Finansiell nytta per intressent\"",null,null,"Diagram \"Omfördelningsnytta nytta per intressent\""]
[null,null,"Nyttokategori","(flera objekt)",null,"Kostnadskategori","(flera objekt)",null,"Nyttokategori","1. Finansiell",null,"Nyttokategori","2. Omfördelningsnytta"]
[]
[null,null,"Radetiketter","Summa av Summa trolig",null,"Radetiketter","Summa av Summa",null,"Radetiketter","Summa av Summa trolig",null,"Radetiketter","Summa av Summa trolig"]
[null,null,"Invånare",{"v":22400525.889750406,"d":"22,400,526 "},null,"Staten",{"v":12310302.573286831,"d":"12,310,303 "},null,"Invånare",{"v":9683224.448018909,"d":"9,683,224 "},null,"Invånare",{"v":12717301.4417315,"d":"12,717,301 "}]
[null,null,"Regioner",{"v":84715799.52984747,"d":"84,715,800 "},null,"Regioner",{"v":34464095.64303003,"d":"34,464,096 "},null,"Totalsumma",{"v":9683224.448018909,"d":"9,683,224 "},null,"Regioner",{"v":84715799.52984747,"d":"84,715,800 "}]
[null,null,"Totalsumma",{"v":107116325.41959788,"d":"107,116,325 "},null,"Inera",{"v":2447500,"d":"2,447,500 "},{"$nulls":4},"Totalsumma",{"v":97433100.97157897,"d":"97,433,101 "}]
[{"$nulls":5},"Totalsumma",{"v":49221898.216316864,"d":"49,221,898 "}]
{"$rows_empty":10}
[null,null,"PivotNyttaOsäkerhet",{"$nulls":5},"PivotKostnadOsäkerhet"]
[null,null,"PivotNytta - underlag till diagram \"osäkerhetsanalys\" ",{"$nulls":5},"PivotKostnad - underlag till diagram \"osäkerhetsanalys\" "]
[null,null,"Radetiketter","Summa av Summa min","Summa av Summa trolig","Summa av Summa max",null,null,"Radetiketter","Summa av Min","Summa av Summa","Summa av Max"]
[null,null,0,0,0,0,null,null,"2. Löpande verksamhetskostnader",{"v":32029452.75277084,"d":"32,029,453 "},{"v":40036815.940963544,"d":"40,036,816 "},{"v":48044179.129156254,"d":"48,044,179 "}]
[null,null,"2. Omfördelningsnytta",{"v":67498813.64315014,"d":"67,498,814 "},{"v":97433100.97157897,"d":"97,433,101 "},{"v":125997785.46721359,"d":"125,997,785 "},null,null,"1. Verksamhetsförändring",{"v":483560.85280220956,"d":"483,561 "},{"v":604451.066002762,"d":"604,451 "},{"v":725341.2792033143,"d":"725,341 "}]
[null,null,"1. Finansiell",{"v":6916588.891442079,"d":"6,916,589 "},{"v":9683224.448018909,"d":"9,683,224 "},{"v":12910965.93069188,"d":"12,910,966 "},null,null,"4. Projekt",{"v":6864504.967480442,"d":"6,864,505 "},{"v":8580631.209350552,"d":"8,580,631 "},{"v":10296757.451220661,"d":"10,296,757 "}]
[null,null,"Totalsumma",{"v":74415402.53459221,"d":"74,415,403 "},{"v":107116325.41959788,"d":"107,116,325 "},{"v":138908751.39790547,"d":"138,908,751 "},null,null,"Totalsumma",{"v":39377518.573053494,"d":"39,377,519 "},{"v":49221898.216316864,"d":"49,221,898 "},{"v":59066277.85958023,"d":"59,066,278 "}]
[]
[]
[]
[null,null,"Diagram \"Osäkerhetsanalys\" Alla nyttor"]
[{"$nulls":3},"Nytta","Kostnad","Nettonytta"]
[null,null,"Min",{"$f":"IFERROR(GETPIVOTDATA(\"Summa av Summa min\",$C$69),0)","v":{"v":74415402.53459221,"d":"74,415,403 "}},{"$f":"GETPIVOTDATA(\"Summa av Min\",$I$69)","v":{"v":39377518.573053494,"d":"39,377,519 "}},{"$f":"D79-E81","v":{"v":15349124.675011978,"d":"15,349,125 "}}]
[null,null,"Troligt",{"$f":"IFERROR(GETPIVOTDATA(\"Summa av Summa trolig\",$C$69),0)","v":{"v":107116325.41959788,"d":"107,116,325 "}},{"$f":"GETPIVOTDATA(\"Summa av Summa\",$I$69)","v":{"v":49221898.216316864,"d":"49,221,898 "}},{"$f":"D80-E80","v":{"v":57894427.203281015,"d":"57,894,427 "}},null,null,"Fördelning av nyttor"]
[null,null,"Max",{"$f":"IFERROR(GETPIVOTDATA(\"Summa av Summa max\",$C$69),0)","v":{"v":138908751.39790547,"d":"138,908,751 "}},{"$f":"GETPIVOTDATA(\"Summa av Max\",$I$69)","v":{"v":59066277.85958023,"d":"59,066,278 "}},{"$f":"D81-E79","v":{"v":99531232.82485197,"d":"99,531,233 "}},null,null,"Summa av Summa trolig","Kolumnetiketter"]
[{"$nulls":8},"Radetiketter",0,"Video - sparar tid","Video - sparar pengar","Totalsumma"]
[{"$nulls":8},"Invånare",0,{"v":12717301.4417315,"d":"12,717,301 "},{"v":9683224.448018909,"d":"9,683,224 "},{"v":22400525.889750406,"d":"22,400,526 "}]
[null,null,"Diagram \"Osäkerhetsanalys\" Finansiella nyttor",{"$nulls":5},"Totalsumma",0,{"v":12717301.4417315,"d":"12,717,301 "},{"v":9683224.448018909,"d":"9,683,224 "},{"v":22400525.889750406,"d":"22,400,526 "}]
[{"$nulls":3},"Finansiell nytta","Kostnad","Nettonytta"]
[null,null,"Min",{"$f":"IFERROR(GETPIVOTDATA(\"Summa av Summa min\",$C$69,\"Nyttokategori\",\"1. Finansiell\"),0)","v":{"v":6916588.891442079,"d":"6,916,589 "}},{"$f":"GETPIVOTDATA(\"Summa av Min\",$I$69)","v":{"v":39377518.573053494,"d":"39,377,519 "}},{"$f":"D86-E88","v":{"v":-52149688.96813816,"d":"-52,149,689 "}}]
[null,null,"Troligt",{"$f":"IFERROR(GETPIVOTDATA(\"Summa av Summa trolig\",$C$69,\"Nyttokategori\",\"1. Finansiell\"),0)","v":{"v":9683224.448018909,"d":"9,683,224 "}},{"$f":"GETPIVOTDATA(\"Summa av Summa\",$I$69)","v":{"v":49221898.216316864,"d":"49,221,898 "}},{"$f":"D87-E87","v":{"v":-39538673.768297955,"d":"-39,538,674 "}}]
[null,null,"Max",{"$f":"IFERROR(GETPIVOTDATA(\"Summa av Summa max\",$C$69,\"Nyttokategori\",\"1. Finansiell\"),0)","v":{"v":12910965.93069188,"d":"12,910,966 "}},{"$f":"GETPIVOTDATA(\"Summa av Max\",$I$69)","v":{"v":59066277.85958023,"d":"59,066,278 "}},{"$f":"D88-E86","v":{"v":-26466552.642361615,"d":"-26,466,553 "}}]
[]
[]
[null,null,"Diagram \"Osäkerhetsanalys\" Omfördelningsnyttor"]
[{"$nulls":3},"Omfördelningsnytta","Kostnad","Nettonytta"]
[null,null,"Min",{"$f":"IFERROR(GETPIVOTDATA(\"Summa av Summa min\",$C$69,\"Nyttokategori\",\"2. Omfördelningsnytta\"),0)","v":{"v":67498813.64315014,"d":"67,498,814 "}},{"$f":"Kostnader[[#Totals],[Min]]","v":{"v":39377518.573053494,"d":"39,377,519 "}},{"$f":"D93-E95","v":{"v":8432535.783569917,"d":"8,432,536 "}}]
[null,null,"Troligt",{"$f":"IFERROR(GETPIVOTDATA(\"Summa av Summa trolig\",$C$69,\"Nyttokategori\",\"2. Omfördelningsnytta\"),0)","v":{"v":97433100.97157897,"d":"97,433,101 "}},{"$f":"Kostnader[[#Totals],[Summa]]","v":{"v":49221898.21631686,"d":"49,221,898 "}},{"$f":"D94-E94","v":{"v":48211202.755262114,"d":"48,211,203 "}}]
[null,null,"Max",{"$f":"IFERROR(GETPIVOTDATA(\"Summa av Summa max\",$C$69,\"Nyttokategori\",\"2. Omfördelningsnytta\"),0)","v":{"v":125997785.46721359,"d":"125,997,785 "}},{"$f":"Kostnader[[#Totals],[Max]]","v":{"v":59066277.85958022,"d":"59,066,278 "}},{"$f":"D95-E93","v":{"v":86620266.89416009,"d":"86,620,267 "}}]
[]
[]
[null,null,"Underlag för payback-år"]
[null,null,"Alla nyttor"]
[null,null,"Följande rader används för beräkning av Payback-år",{"$f":"Startår","v":2019},{"$f":"D100+1","v":2020},{"$f":"E100+1","v":2021},2022,2023,2024]
[null,null,"Ack. diskonterat kassaflöde > 0?",{"$f":"Nyttokalkyl!I27>0","v":false},{"$f":"Nyttokalkyl!J27>0","v":false},{"$f":"Nyttokalkyl!K27>0","v":false},{"$f":"Nyttokalkyl!L27>0","v":false},{"$f":"Nyttokalkyl!M27>0","v":true},{"$f":"Nyttokalkyl!N27>0","v":true}]
[null,null,"Är detta ett paybackår?",{"$f":"IF(D101=FALSE,\"x\",D100)","v":"x"},{"$f":"IF(E101=FALSE,\"x\",E100)","v":"x"},"x","x",{"v":2023,"d":"2,023 "},{"v":2024,"d":"2,024 "}]
[null,null,"Första paybackår (om något)",{"$f":"MIN(D102:I102)","v":{"v":2023,"d":"2,023 "}}]
[null,null,"Paybackår?",{"$f":"IF('-Admin-'!D103=0,\"Ingen payback\",'-Admin-'!D103)","v":2023}]
[]
[]
[null,null,"Finansiella nyttor"]
[null,null,"Följande rader används för beräkning av Payback-år",{"$f":"Startår","v":2019},{"$f":"D108+1","v":2020},{"$f":"E108+1","v":2021},{"$f":"F108+1","v":2022},{"$f":"G108+1","v":2023},{"$f":"H108+1","v":2024}]
[null,null,"Ack. diskonterat kassaflöde > 0?",{"$f":"Nyttokalkyl!I72>0","v":false},{"$f":"Nyttokalkyl!J72>0","v":false},{"$f":"Nyttokalkyl!K72>0","v":false},{"$f":"Nyttokalkyl!L72>0","v":false},{"$f":"Nyttokalkyl!M72>0","v":false},{"$f":"Nyttokalkyl!N72>0","v":false}]
[null,null,"Är detta ett paybackår?",{"$f":"IF(D109=FALSE,\"x\",D108)","v":"x"},{"$f":"IF(E109=FALSE,\"x\",E108)","v":"x"},"x","x","x","x"]
[null,null,"Första paybackår (om något)",{"$f":"MIN(D110:I110)","v":0}]
[null,null,"Paybackår?",{"$f":"IF('-Admin-'!D111=0,\"Ingen payback\",'-Admin-'!D111)","v":"Ingen payback"}]
[]
[]
[null,null,"Omfördelningsnyttor"]
[null,null,"Följande rader används för beräkning av Payback-år",{"$f":"Startår","v":2019},{"$f":"D116+1","v":2020},{"$f":"E116+1","v":2021},{"$f":"F116+1","v":2022},{"$f":"G116+1","v":2023},{"$f":"H116+1","v":2024}]
[null,null,"Ack. diskonterat kassaflöde > 0?",{"$f":"Nyttokalkyl!I123>0","v":false},{"$f":"Nyttokalkyl!J123>0","v":false},{"$f":"Nyttokalkyl!K123>0","v":false},{"$f":"Nyttokalkyl!L123>0","v":false},{"$f":"Nyttokalkyl!M123>0","v":true},{"$f":"Nyttokalkyl!N123>0","v":true}]
[null,null,"Är detta ett paybackår?",{"$f":"IF(D117=FALSE,\"x\",D116)","v":"x"},{"$f":"IF(E117=FALSE,\"x\",E116)","v":"x"},"x","x",{"v":2023,"d":"2,023 "},{"v":2024,"d":"2,024 "}]
[null,null,"Första paybackår (om något)",{"$f":"MIN(D118:I118)","v":{"v":2023,"d":"2,023 "}}]
[null,null,"Paybackår?",{"$f":"IF('-Admin-'!D119=0,\"Ingen payback\",'-Admin-'!D119)","v":2023}]