{"text_format":"3","workbook":"xlsx","n_sheets":6,"sheets":["Försättsblad","Räkna på nyttorna","Nyttor","Kostnader","Nyttokalkyl","-Admin-"],"not_rendered":{"charts":14,"macros":1,"external_links":2,"defined_names":7,"pivot_tables":8},"read":"whole","date_system":"1900"}

{"sheet":"Försättsblad","index":0,"n_rows":37,"n_cols":5,"rows_kept":37}
[null,"Försättsblad"]
[null,{"$f":"IF(B6=0,\"\",B6)","v":"UX-ramverket"}]
[]
[]
[null,"Tjänst / projekt / förändringsinitiativ"]
[null,"UX-ramverket"]
[]
[]
[null,"Revisionshistorik"]
[null,"Version","Datum","Författare","Kommentar"]
[null,"0.1","2020-11-13","Amanda Sundberg, Andreas Melin, Pia Jonsson","Påbörjar kalkylen"]
[null,"0.2","2020-11-20","Amanda Sundberg, Andreas Melin, Pia Jonsson","Reviderar"]
[null,"0.3","2020-11-30","Amanda Sundberg, Andreas Melin, Pia Jonsson","Reviderar"]
{"$rows_empty":10}
[null,"Startår"]
[null,"Från när vill ni börja räkna nyttor och kostnader? "]
[]
[null,"Parameter","Värde"]
[null,"Startår",2020]
[]
[]
[null,"Intressenter"]
[null,"Ange de intressenter som bär nyttor eller kostnader alternativt är involverade i genomförandet. \nDe intressenter som anges här kommer att visas och bli valbara i den här mallens flikar om kostnader och nyttor. "]
[]
[null,"Intressent"]
[null,"Inera"]
[null,"Regionen"]
[null,"Invånare"]

{"sheet":"Räkna på nyttorna","index":1,"n_rows":348,"n_cols":21,"rows_kept":348,"merged":[[4,2,4,4],[5,2,17,2],[21,2,21,4],[22,2,34,2],[38,2,38,4],[39,2,51,2],[55,2,55,4],[56,2,68,2],[72,2,72,4],[73,2,85,2],[89,2,89,4],[90,2,102,2],[106,2,106,4],[107,2,119,2],[123,2,123,4],[124,2,136,2],[140,2,140,4],[141,2,153,2],[157,2,157,4],[158,2,170,2],[174,2,174,4],[175,2,187,2],[191,2,191,4],[192,2,204,2],[208,2,208,4],[209,2,221,2],[225,2,225,4],[226,2,238,2],[242,2,242,4],[243,2,255,2],[259,2,259,4],[260,2,272,2],[276,2,276,4],[277,2,289,2],[293,2,293,4],[294,2,306,2],[310,2,310,4],[311,2,323,2],[327,2,327,4],[328,2,340,2],[344,2,344,4],[345,2,357,2]]}
[null,null,"Räkna på nyttorna"]
[null,null,{"$f":"IF(Försättsblad!B6=0,\"\",Försättsblad!B6)","v":"UX-ramverket"}]
[]
[null,null,"Skriv en beskrivande rubrik för nyttan. ",null,"Använd tabellerna för att räkna fram nyttan.","Ange ert troligaste värde. ","Ange ett min- och max-värde för att få en osäkerhetsbedömning",null,"Var kommer informationen ifrån? ","Använd för att exempelvis markera sådant ni vill se över. ",null,null,"Fyll i nyttan år för år. Dessa summeras sedan automatiskt. Tänk på att alla nyttor kanske inte infaller från första året. ",{"$nulls":5},"Summeras automatiskt","Summeras automatiskt","Summeras automatiskt"]
[1,null,"Frigjord tid för front-end utveckling",null,null,"Trolig","Min","Max","Källa ","Ev. kommentar",null,null,{"$f":"Startår","v":2020},{"$f":"M5+1","v":2021},{"$f":"N5+1","v":2022},2023,2024,2025,"Summa trolig","Summa min","Summa max"]
[null,null,"Nyttobeskrivning\n\nMed hjälp av UX-ramverket är grunden i front-end arbetet redan färdig när utvecklingsprojektet börjar, och front-end utvecklare har redan ett väl etablerat samarbete. Därmed frigörs tid som innan UX-ramverket behövts för front-end utveckling. \n\nDen frigjorda tiden kan exempelvis användas till mer och bättre front-end utveckling som ger mer användarvänliga tjänster.",null,"Kostnad för Ineras utvecklingsprojekt över 6 år",{"v":960000000,"d":"960,000,000 kr"},{"v":420000000,"d":"420,000,000 "},{"v":1500000000,"d":"1,500,000,000 "},"CG Höglund",null,null,"Trolig",null,{"$f":"$F$19","v":{"v":16000000,"d":"16,000,000 "}},{"$f":"$F$19","v":{"v":16000000,"d":"16,000,000 "}},{"v":16000000,"d":"16,000,000 "},{"v":16000000,"d":"16,000,000 "},{"v":16000000,"d":"16,000,000 "},{"$f":"SUM(M6:R6)","v":{"v":80000000,"d":"80,000,000 "}},{"$f":"SUM(M7:R7)","v":{"v":21000000,"d":"21,000,000 "}},{"$f":"SUM(M8:R8)","v":{"v":150000000,"d":"150,000,000 "}}]
[{"$nulls":4},"Kostnad för Ineras utvecklingsprojekt per år ",{"$f":"F6/6","v":{"v":160000000,"d":"160,000,000 kr"}},{"$f":"G6/6","v":{"v":70000000,"d":"70,000,000 "}},{"$f":"H6/6","v":{"v":250000000,"d":"250,000,000 "}},"CG Höglund",null,null,"Min",null,{"$f":"$G$19","v":{"v":4200000,"d":"4,200,000 "}},{"$f":"$G$19","v":{"v":4200000,"d":"4,200,000 "}},{"v":4200000,"d":"4,200,000 "},{"v":4200000,"d":"4,200,000 "},{"v":4200000,"d":"4,200,000 "}]
[{"$nulls":4},"Andel av kostnaden som är front-end kod",{"v":0.2,"d":"20%"},{"v":0.2,"d":"20%"},{"v":0.2,"d":"20%"},"Andreas Melin",null,null,"Max",null,{"$f":"$H$19","v":{"v":30000000,"d":"30,000,000 "}},{"$f":"$H$19","v":{"v":30000000,"d":"30,000,000 "}},{"v":30000000,"d":"30,000,000 "},{"v":30000000,"d":"30,000,000 "},{"v":30000000,"d":"30,000,000 "}]
[{"$nulls":4},"Kostnad för Ineras front-end utveckling per år",{"$f":"F8*F7","v":{"v":32000000,"d":"32,000,000 kr"}},{"$f":"G8*G7","v":{"v":14000000,"d":"14,000,000 "}},{"$f":"H8*H7","v":{"v":50000000,"d":"50,000,000 "}},"Andreas Melin"]
[{"$nulls":4},"Förväntad minskning av kostnaden med hjälp av UX-ramverket",{"v":0.5,"d":"50%"},{"v":0.3,"d":"30%"},{"v":0.6,"d":"60%"},"Andreas Melin"]
[{"$nulls":4},"Frigjorda resurser  för front-end utevckling med UX-ramverket per år",{"$f":"F10*F9","v":{"v":16000000,"d":"16,000,000 kr"}},{"$f":"G10*G9","v":{"v":4200000,"d":"4,200,000 "}},{"$f":"H10*H9","v":{"v":30000000,"d":"30,000,000 "}},"Andreas Melin"]
[{"$nulls":4},"Timkostnad front-end utvecklare",{"v":900,"d":"900 kr"},{"v":900,"d":"900 "},{"v":900,"d":"900 "},"Andreas Melin"]
[{"$nulls":4},"Frigjorda timmar för front-end utveckling per år",{"$f":"F11/F12","v":{"v":17777.777777777777,"d":"17,778 "}},{"$f":"G11/G12","v":{"v":4666.666666666667,"d":"4,667 "}},{"$f":"H11/H12","v":{"v":33333.333333333336,"d":"33,333 "}}]
[]
[]
[]
[]
[]
[{"$nulls":4},"Värdet på frigjord front-end utveckling per år",{"$f":"F11","v":{"v":16000000,"d":"16,000,000 kr"}},{"$f":"G11","v":{"v":4200000,"d":"4,200,000 kr"}},{"v":30000000,"d":"30,000,000 kr"}]
[]
[]
[2,null,"Frigjord tid för UX",null,null,"Trolig","Min","Max","Källa ","Ev. kommentar",null,null,{"$f":"Startår","v":2020},{"$f":"M22+1","v":2021},{"$f":"N22+1","v":2022},{"$f":"O22+1","v":2023},{"$f":"P22+1","v":2024},{"$f":"Q22+1","v":2025},"Summa trolig","Summa min","Summa max"]
[null,null,"Nyttobeskrivning\n\nMed hjälp av UX-ramverket är grunden i UX-arbete redan färdig när utvecklingsprojektet börjar, och UX:are på Inera har redan ett väl etablerat samarbete. Därmed frigörs tid som innan UX-ramverket behövdes för UX-arbete. \n\n\nDen frigjorda tiden kan exempelvis användas till mer och bättre UX som ger mer användarvänliga tjänster.",null,"Kostnad för Ineras utvecklingsprojekt per år",{"$f":"F7","v":{"v":160000000,"d":"160,000,000 kr"}},{"$f":"G7","v":{"v":70000000,"d":"70,000,000 "}},{"v":250000000,"d":"250,000,000 "},"CG",null,null,"Trolig",null,{"$f":"$F$36","v":{"v":6400000,"d":"6,400,000 "}},{"$f":"$F$36","v":{"v":6400000,"d":"6,400,000 "}},{"v":6400000,"d":"6,400,000 "},{"v":6400000,"d":"6,400,000 "},{"v":6400000,"d":"6,400,000 "},{"$f":"SUM(M23:R23)","v":{"v":32000000,"d":"32,000,000 "}},{"$f":"SUM(M24:R24)","v":{"v":7000000,"d":"7,000,000 "}},{"$f":"SUM(M25:R25)","v":{"v":75000000,"d":"75,000,000 "}}]
[{"$nulls":4},"Andel av kostnaden som är UX",{"v":0.15,"d":"15%"},{"v":0.15,"d":"15%"},{"v":0.15,"d":"15%"},"Andreas Melin",null,null,"Min",null,{"$f":"$G$36","v":{"v":1400000,"d":"1,400,000 "}},{"$f":"$G$36","v":{"v":1400000,"d":"1,400,000 "}},{"v":1400000,"d":"1,400,000 "},{"v":1400000,"d":"1,400,000 "},{"v":1400000,"d":"1,400,000 "}]
[{"$nulls":4},"Kostnad för UX per år",{"$f":"F24*F23","v":{"v":24000000,"d":"24,000,000 kr"}},{"$f":"G24*G23","v":{"v":10500000,"d":"10,500,000 "}},{"$f":"H24*H23","v":{"v":37500000,"d":"37,500,000 "}},"Andreas Melin",null,null,"Max",null,{"$f":"$H$36","v":{"v":15000000,"d":"15,000,000 "}},{"$f":"$H$36","v":{"v":15000000,"d":"15,000,000 "}},{"v":15000000,"d":"15,000,000 "},{"v":15000000,"d":"15,000,000 "},{"v":15000000,"d":"15,000,000 "}]
[{"$nulls":4},"Förväntad andel av kostnaden som blir UX med UX-ramverket",{"v":0.11,"d":"11%"},{"v":0.13,"d":"13%"},{"v":0.09,"d":"9%"},"Andreas Melin"]
[{"$nulls":4},"Förväntad kostnad för UX per år med UX-ramverket",{"$f":"F26*F23","v":{"v":17600000,"d":"17,600,000 kr"}},{"$f":"G26*G23","v":{"v":9100000,"d":"9,100,000 "}},{"$f":"H26*H23","v":{"v":22500000,"d":"22,500,000 "}},"Andreas Melin"]
[{"$nulls":4},"Sparade resurser på UX",{"$f":"F25-F27","v":{"v":6400000,"d":"6,400,000 kr"}},{"$f":"G25-G27","v":{"v":1400000,"d":"1,400,000 "}},{"$f":"H25-H27","v":{"v":15000000,"d":"15,000,000 "}},"Andreas Melin"]
[{"$nulls":4},"Timkostnad för UX",{"v":900,"d":"900 kr"},{"v":900,"d":"900 "},{"v":900,"d":"900 "},"Andreas Melin"]
[{"$nulls":4},"Frigjorda timmar för UX-arbete",{"$f":"F28/F29","v":{"v":7111.111111111111,"d":"7,111 "}},{"$f":"G28/G29","v":{"v":1555.5555555555557,"d":"1,556 "}},{"$f":"H28/H29","v":{"v":16666.666666666668,"d":"16,667 "}},"Andreas Melin"]
[]
[]
[]
[]
[]
[{"$nulls":4},"Värdet på frigjorda UX-resurser per år",{"$f":"F28","v":{"v":6400000,"d":"6,400,000 kr"}},{"$f":"G28","v":{"v":1400000,"d":"1,400,000 kr"}},{"v":15000000,"d":"15,000,000 kr"}]
[]
[]
[3,null,"Frigjord tid för utvecklare som åtgärdar användbarhetsproblem i efterhand",null,null,"Trolig","Min","Max","Källa ","Ev. kommentar",null,null,{"$f":"Startår","v":2020},{"$f":"M39+1","v":2021},{"$f":"N39+1","v":2022},{"$f":"O39+1","v":2023},{"$f":"P39+1","v":2024},{"$f":"Q39+1","v":2025},"Summa trolig","Summa min","Summa max"]
[null,null,"Nyttobeskrivning\n\nUX-ramverket säkerställer att de tjänster som utvecklas har hög användbarhet, vilket innebär att Ineras kostnader för att åtgärda användbarhetsproblem i efterhand minskar. \n\nOfta brukar man säga att det tar en timma att åtgärda ett användbarhetsproblem på pappret, 10 timmar i prototyp och 100 timmar i utveckling. ",null,"Antal användbarhets- eller tillgänglighetsbuggar per år i PWT",{"v":750,"d":"750 "},{"v":600,"d":"600 "},{"v":1000,"d":"1,000 "},"Andreas Melin",null,null,"Trolig",null,null,{"$f":"$F$53","v":{"v":3240000,"d":"3,240,000 "}},{"$f":"$F$53","v":{"v":3240000,"d":"3,240,000 "}},{"v":3240000,"d":"3,240,000 "},{"v":3240000,"d":"3,240,000 "},{"$f":"SUM(M40:R40)","v":{"v":12960000,"d":"12,960,000 "}},{"$f":"SUM(M41:R41)","v":{"v":6912000,"d":"6,912,000 "}},{"$f":"SUM(M42:R42)","v":{"v":20160000,"d":"20,160,000 "}}]
[{"$nulls":4},"Andel av buggarna som UX-ramverket förväntas förhindra",{"v":0.6,"d":"60%"},{"v":0.4,"d":"40%"},{"v":0.7,"d":"70%"},"Andreas Melin",null,null,"Min",null,null,{"$f":"$G$53","v":{"v":1728000,"d":"1,728,000 "}},{"$f":"$G$53","v":{"v":1728000,"d":"1,728,000 "}},{"v":1728000,"d":"1,728,000 "},{"v":1728000,"d":"1,728,000 "}]
[{"$nulls":4},"Antal användbarhets- eller tillgänlighetsbuggar som förhindras per år",{"$f":"F41*F40","v":{"v":450,"d":"450 "}},{"$f":"G41*G40","v":{"v":240,"d":"240 "}},{"$f":"H41*H40","v":{"v":700,"d":"700 "}},"Andreas Melin",null,null,"Max",null,null,{"$f":"$H$53","v":{"v":5040000,"d":"5,040,000 "}},{"$f":"$H$53","v":{"v":5040000,"d":"5,040,000 "}},{"v":5040000,"d":"5,040,000 "},{"v":5040000,"d":"5,040,000 "}]
[{"$nulls":4},"Antal timmar som behövs per bugg",{"v":8,"d":"8 "},{"v":8,"d":"8 "},{"v":8,"d":"8 "},"Andreas Melin"]
[{"$nulls":4},"Timmar för att åtgärda användbarhetsproblem per år",{"$f":"F43*F42","v":{"v":3600,"d":"3,600 "}},{"$f":"G43*G42","v":{"v":1920,"d":"1,920 "}},{"$f":"H43*H42","v":{"v":5600,"d":"5,600 "}},"Andreas Melin"]
[{"$nulls":4},"Timpris utvecklare",{"v":900,"d":"900 "},{"v":900,"d":"900 "},{"v":900,"d":"900 "},"Andreas Melin"]
[{"$nulls":4},"Kostnad per år",{"$f":"F45*F44","v":{"v":3240000,"d":"3,240,000 "}},{"$f":"G45*G44","v":{"v":1728000,"d":"1,728,000 "}},{"$f":"H45*H44","v":{"v":5040000,"d":"5,040,000 "}}]
[]
[]
[]
[]
[]
[]
[{"$nulls":4},"Värdet på frigjorda utvecklingsresurser per år",{"$f":"F46","v":{"v":3240000,"d":"3,240,000 "}},{"$f":"G46","v":{"v":1728000,"d":"1,728,000 "}},{"$f":"H46","v":{"v":5040000,"d":"5,040,000 "}}]
[{"$nulls":5},{"$f":"F13+F30+F44","v":{"v":28488.88888888889,"d":"28,489 "}}]
[]
[4,null,"Frigjord tid för Ineras kundtjänst",null,null,"Trolig","Min","Max","Källa ","Ev. kommentar",null,null,{"$f":"Startår","v":2020},{"$f":"M56+1","v":2021},{"$f":"N56+1","v":2022},{"$f":"O56+1","v":2023},{"$f":"P56+1","v":2024},{"$f":"Q56+1","v":2025},"Summa trolig","Summa min","Summa max"]
[null,null,"Det kostar 35 kr per mejl/telefonsamtal enligt Camilla Widmark. Så ett ärende kan generera fler kontakter - och därför är kostnaden per ärende kanske underskattad. \n\nAntalet kontatker låg på 24 000 ärenden 2020 tom april - vilket skulle bli 72 000 per år - men eftersom mars och april var coronamånader väljer vi 50 000 per år för att mer spegla ett vanligt år. ",null,"Ärenden till kundtjänst på grund av användbarhetsproblem per år",{"v":50000,"d":"50,000 "},{"v":50000,"d":"50,000 "},{"v":50000,"d":"50,000 "},"Camilla Widmark","Osäker",null,"Trolig",null,null,{"$f":"$F$70","v":{"v":700000,"d":"700,000 "}},{"$f":"$F$70","v":{"v":700000,"d":"700,000 "}},{"v":700000,"d":"700,000 "},{"v":700000,"d":"700,000 "},{"$f":"SUM(M57:R57)","v":{"v":2800000,"d":"2,800,000 "}},{"$f":"SUM(M58:R58)","v":{"v":1400000,"d":"1,400,000 "}},{"$f":"SUM(M59:R59)","v":{"v":4200000,"d":"4,200,000 "}}]
[{"$nulls":4},"Andel ärenden som kan undvikas med UX-ramverket",{"v":0.4,"d":"40%"},{"v":0.2,"d":"20%"},{"v":0.6,"d":"60%"},"Andreas Melin","Osäker",null,"Min",null,null,{"$f":"$G$70","v":{"v":350000,"d":"350,000 "}},{"$f":"$G$70","v":{"v":350000,"d":"350,000 "}},{"v":350000,"d":"350,000 "},{"v":350000,"d":"350,000 "}]
[{"$nulls":4},"Kostnad per ärende",{"v":35,"d":"35 kr"},{"v":35,"d":"35 "},{"v":35,"d":"35 "},"Camilla Widmark","Osäker",null,"Max",null,null,{"$f":"$H$70","v":{"v":1050000,"d":"1,050,000 "}},{"$f":"$H$70","v":{"v":1050000,"d":"1,050,000 "}},{"v":1050000,"d":"1,050,000 "},{"v":1050000,"d":"1,050,000 "}]
[{"$nulls":4},"Värde för minskade ärenden",{"$f":"F57*F58*F59","v":{"v":700000,"d":"700,000 kr"}},{"$f":"G57*G58*G59","v":{"v":350000,"d":"350,000 "}},{"$f":"H57*H58*H59","v":{"v":1050000,"d":"1,050,000 "}}]
{"$rows_empty":9}
[{"$nulls":4},"Värdet på frigjord tid för Ineras kundtjänst per år",{"$f":"F60","v":{"v":700000,"d":"700,000 "}},{"$f":"G60","v":{"v":350000,"d":"350,000 "}},{"v":1050000,"d":"1,050,000 "}]
[]
[]
[5,null,"Frigjord tid för invånare genom ökad användbarhet - exempel inloggning 1177.se",null,null,"Trolig","Min","Max","Källa ","Ev. kommentar",null,null,{"$f":"Startår","v":2020},{"$f":"M73+1","v":2021},{"$f":"N73+1","v":2022},{"$f":"O73+1","v":2023},{"$f":"P73+1","v":2024},{"$f":"Q73+1","v":2025},"Summa trolig","Summa min","Summa max"]
[{"$nulls":4},"Antal inloggningar på 1177.se per år",{"v":70000000,"d":"70,000,000 "},{"v":50000000,"d":"50,000,000 "},{"v":90000000,"d":"90,000,000 "},"Inera.se",null,null,"Trolig",null,{"$f":"$F$87","v":{"v":27222222.22222222,"d":"27,222,222 "}},{"$f":"$F$87","v":{"v":27222222.22222222,"d":"27,222,222 "}},{"v":27222222.22222222,"d":"27,222,222 "},{"v":27222222.22222222,"d":"27,222,222 "},{"v":27222222.22222222,"d":"27,222,222 "},{"$f":"SUM(M74:R74)","v":{"v":136111111.1111111,"d":"136,111,111 "}},{"$f":"SUM(M75:R75)","v":{"v":97222222.22222222,"d":"97,222,222 "}},{"$f":"SUM(M76:R76)","v":{"v":175000000,"d":"175,000,000 "}}]
[{"$nulls":4},"Antal klick för att logga in innan UX-ramverket",{"v":8,"d":"8 "},{"v":8,"d":"8 "},{"v":8,"d":"8 "},"Andreas Melin",null,null,"Min",null,{"$f":"$G$87","v":{"v":19444444.444444444,"d":"19,444,444 "}},{"$f":"$G$87","v":{"v":19444444.444444444,"d":"19,444,444 "}},{"v":19444444.444444444,"d":"19,444,444 "},{"v":19444444.444444444,"d":"19,444,444 "},{"v":19444444.444444444,"d":"19,444,444 "}]
[{"$nulls":4},"Sekunder per klick",{"v":5,"d":"5 "},{"v":5,"d":"5 "},{"v":5,"d":"5 "},"Andreas Melin",null,null,"Max",null,{"$f":"$H$87","v":{"v":35000000,"d":"35,000,000 "}},{"$f":"$H$87","v":{"v":35000000,"d":"35,000,000 "}},{"v":35000000,"d":"35,000,000 "},{"v":35000000,"d":"35,000,000 "},{"v":35000000,"d":"35,000,000 "}]
[{"$nulls":4},"Antal sekunder för att logga in för UX-ravmerket",{"$f":"F76*F75*F74","v":{"v":2800000000,"d":"2,800,000,000 "}},{"$f":"G76*G75*G74","v":{"v":2000000000,"d":"2,000,000,000 "}},{"v":3600000000,"d":"3,600,000,000 "}]
[{"$nulls":4},"Antal klick för att logg in efter UX-ravmerket",{"v":4,"d":"4 "},{"v":4,"d":"4 "},{"v":4,"d":"4 "},"Andreas Melin"]
[{"$nulls":4},"Antal sekunder för att logga in efter UX-ramverket",{"$f":"F78*F76*F74","v":{"v":1400000000,"d":"1,400,000,000 "}},{"$f":"G78*G76*G74","v":{"v":1000000000,"d":"1,000,000,000 "}},{"v":1800000000,"d":"1,800,000,000 "}]
[{"$nulls":4},"Sparade sekunder",{"$f":"F77-F79","v":{"v":1400000000,"d":"1,400,000,000 "}},{"$f":"G77-G79","v":{"v":1000000000,"d":"1,000,000,000 "}},{"v":1800000000,"d":"1,800,000,000 "},{"$nulls":4},{"$f":"24/4","v":6}]
[{"$nulls":4},"Sparade timmar",{"$f":"F80/60/60","v":{"v":388888.8888888889,"d":"388,889 "}},{"$f":"G80/60/60","v":{"v":277777.77777777775,"d":"277,778 "}},{"v":500000,"d":"500,000 "},{"$nulls":4},{"$f":"M80*12","v":72}]
[{"$nulls":4},"Värdering av en invånares tid för en timme",{"v":70,"d":"70 "},{"v":70,"d":"70 "},{"v":70,"d":"70 "}]
[]
[]
[]
[]
[{"$nulls":4},"Värdet på frigjord tid för en invånare genom ökad användbarhet - exempel 1177.se",{"$f":"F82*F81","v":{"v":27222222.22222222,"d":"27,222,222 "}},{"$f":"G82*G81","v":{"v":19444444.444444444,"d":"19,444,444 "}},{"v":35000000,"d":"35,000,000 "}]
[]
[]
[6,{"$nulls":4},"Trolig","Min","Max","Källa ","Ev. kommentar",null,null,{"$f":"Startår","v":2020},{"$f":"M90+1","v":2021},{"$f":"N90+1","v":2022},{"$f":"O90+1","v":2023},{"$f":"P90+1","v":2024},{"$f":"Q90+1","v":2025},"Summa trolig","Summa min","Summa max"]
[{"$nulls":11},"Trolig",{"$nulls":6},{"$f":"SUM(M91:R91)","v":0},{"$f":"SUM(M92:R92)","v":0},{"$f":"SUM(M93:R93)","v":0}]
[{"$nulls":11},"Min"]
[{"$nulls":11},"Max"]
{"$rows_empty":13}
[7,{"$nulls":4},"Trolig","Min","Max","Källa ","Ev. kommentar",null,null,{"$f":"Startår","v":2020},{"$f":"M107+1","v":2021},{"$f":"N107+1","v":2022},{"$f":"O107+1","v":2023},{"$f":"P107+1","v":2024},{"$f":"Q107+1","v":2025},"Summa trolig","Summa min","Summa max"]
[{"$nulls":11},"Trolig",{"$nulls":6},{"$f":"SUM(M108:R108)","v":0},{"$f":"SUM(M109:R109)","v":0},{"$f":"SUM(M110:R110)","v":0}]
[{"$nulls":11},"Min"]
[{"$nulls":11},"Max"]
{"$rows_empty":13}
[8,{"$nulls":4},"Trolig","Min","Max","Källa ","Ev. kommentar",null,null,{"$f":"Startår","v":2020},{"$f":"M124+1","v":2021},{"$f":"N124+1","v":2022},{"$f":"O124+1","v":2023},{"$f":"P124+1","v":2024},{"$f":"Q124+1","v":2025},"Summa trolig","Summa min","Summa max"]
[{"$nulls":11},"Trolig",{"$nulls":6},{"$f":"SUM(M125:R125)","v":0},{"$f":"SUM(M126:R126)","v":0},{"$f":"SUM(M127:R127)","v":0}]
[{"$nulls":11},"Min"]
[{"$nulls":11},"Max"]
{"$rows_empty":13}
[9,{"$nulls":4},"Trolig","Min","Max","Källa ","Ev. kommentar",null,null,{"$f":"Startår","v":2020},{"$f":"M141+1","v":2021},{"$f":"N141+1","v":2022},{"$f":"O141+1","v":2023},{"$f":"P141+1","v":2024},{"$f":"Q141+1","v":2025},"Summa trolig","Summa min","Summa max"]
[{"$nulls":11},"Trolig",{"$nulls":6},{"$f":"SUM(M142:R142)","v":0},{"$f":"SUM(M143:R143)","v":0},{"$f":"SUM(M144:R144)","v":0}]
[{"$nulls":11},"Min"]
[{"$nulls":11},"Max"]
{"$rows_empty":13}
[10,{"$nulls":4},"Trolig","Min","Max","Källa ","Ev. kommentar",null,null,{"$f":"Startår","v":2020},{"$f":"M158+1","v":2021},{"$f":"N158+1","v":2022},{"$f":"O158+1","v":2023},{"$f":"P158+1","v":2024},{"$f":"Q158+1","v":2025},"Summa trolig","Summa min","Summa max"]
[{"$nulls":11},"Trolig",{"$nulls":6},{"$f":"SUM(M159:R159)","v":0},{"$f":"SUM(M160:R160)","v":0},{"$f":"SUM(M161:R161)","v":0}]
[{"$nulls":11},"Min"]
[{"$nulls":11},"Max"]
{"$rows_empty":13}
[11,{"$nulls":4},"Trolig","Min","Max","Källa ","Ev. kommentar",null,null,{"$f":"Startår","v":2020},{"$f":"M175+1","v":2021},{"$f":"N175+1","v":2022},{"$f":"O175+1","v":2023},{"$f":"P175+1","v":2024},{"$f":"Q175+1","v":2025},"Summa trolig","Summa min","Summa max"]
[{"$nulls":11},"Trolig",{"$nulls":6},{"$f":"SUM(M176:R176)","v":0},{"$f":"SUM(M177:R177)","v":0},{"$f":"SUM(M178:R178)","v":0}]
[{"$nulls":11},"Min"]
[{"$nulls":11},"Max"]
{"$rows_empty":13}
[12,{"$nulls":4},"Trolig","Min","Max","Källa ","Ev. kommentar",null,null,{"$f":"Startår","v":2020},{"$f":"M192+1","v":2021},{"$f":"N192+1","v":2022},{"$f":"O192+1","v":2023},{"$f":"P192+1","v":2024},{"$f":"Q192+1","v":2025},"Summa trolig","Summa min","Summa max"]
[{"$nulls":11},"Trolig",{"$nulls":6},{"$f":"SUM(M193:R193)","v":0},{"$f":"SUM(M194:R194)","v":0},{"$f":"SUM(M195:R195)","v":0}]
[{"$nulls":11},"Min"]
[{"$nulls":11},"Max"]
{"$rows_empty":13}
[13,{"$nulls":4},"Trolig","Min","Max","Källa ","Ev. kommentar",null,null,{"$f":"Startår","v":2020},{"$f":"M209+1","v":2021},{"$f":"N209+1","v":2022},{"$f":"O209+1","v":2023},{"$f":"P209+1","v":2024},{"$f":"Q209+1","v":2025},"Summa trolig","Summa min","Summa max"]
[{"$nulls":11},"Trolig",{"$nulls":6},{"$f":"SUM(M210:R210)","v":0},{"$f":"SUM(M211:R211)","v":0},{"$f":"SUM(M212:R212)","v":0}]
[{"$nulls":11},"Min"]
[{"$nulls":11},"Max"]
{"$rows_empty":13}
[14,{"$nulls":4},"Trolig","Min","Max","Källa ","Ev. kommentar",null,null,{"$f":"Startår","v":2020},{"$f":"M226+1","v":2021},{"$f":"N226+1","v":2022},{"$f":"O226+1","v":2023},{"$f":"P226+1","v":2024},{"$f":"Q226+1","v":2025},"Summa trolig","Summa min","Summa max"]
[{"$nulls":11},"Trolig",{"$nulls":6},{"$f":"SUM(M227:R227)","v":0},{"$f":"SUM(M228:R228)","v":0},{"$f":"SUM(M229:R229)","v":0}]
[{"$nulls":11},"Min"]
[{"$nulls":11},"Max"]
{"$rows_empty":13}
[15,{"$nulls":4},"Trolig","Min","Max","Källa ","Ev. kommentar",null,null,{"$f":"Startår","v":2020},{"$f":"M243+1","v":2021},{"$f":"N243+1","v":2022},{"$f":"O243+1","v":2023},{"$f":"P243+1","v":2024},{"$f":"Q243+1","v":2025},"Summa trolig","Summa min","Summa max"]
[{"$nulls":11},"Trolig",{"$nulls":6},{"$f":"SUM(M244:R244)","v":0},{"$f":"SUM(M245:R245)","v":0},{"$f":"SUM(M246:R246)","v":0}]
[{"$nulls":11},"Min"]
[{"$nulls":11},"Max"]
{"$rows_empty":13}
[16,{"$nulls":4},"Trolig","Min","Max","Källa ","Ev. kommentar",null,null,{"$f":"Startår","v":2020},{"$f":"M260+1","v":2021},{"$f":"N260+1","v":2022},{"$f":"O260+1","v":2023},{"$f":"P260+1","v":2024},{"$f":"Q260+1","v":2025},"Summa trolig","Summa min","Summa max"]
[{"$nulls":11},"Trolig",{"$nulls":6},{"$f":"SUM(M261:R261)","v":0},{"$f":"SUM(M262:R262)","v":0},{"$f":"SUM(M263:R263)","v":0}]
[{"$nulls":11},"Min"]
[{"$nulls":11},"Max"]
{"$rows_empty":13}
[17,{"$nulls":4},"Trolig","Min","Max","Källa ","Ev. kommentar",null,null,{"$f":"Startår","v":2020},{"$f":"M277+1","v":2021},{"$f":"N277+1","v":2022},{"$f":"O277+1","v":2023},{"$f":"P277+1","v":2024},{"$f":"Q277+1","v":2025},"Summa trolig","Summa min","Summa max"]
[{"$nulls":11},"Trolig",{"$nulls":6},{"$f":"SUM(M278:R278)","v":0},{"$f":"SUM(M279:R279)","v":0},{"$f":"SUM(M280:R280)","v":0}]
[{"$nulls":11},"Min"]
[{"$nulls":11},"Max"]
{"$rows_empty":13}
[18,{"$nulls":4},"Trolig","Min","Max","Källa ","Ev. kommentar",null,null,{"$f":"Startår","v":2020},{"$f":"M294+1","v":2021},{"$f":"N294+1","v":2022},{"$f":"O294+1","v":2023},{"$f":"P294+1","v":2024},{"$f":"Q294+1","v":2025},"Summa trolig","Summa min","Summa max"]
[{"$nulls":11},"Trolig",{"$nulls":6},{"$f":"SUM(M295:R295)","v":0},{"$f":"SUM(M296:R296)","v":0},{"$f":"SUM(M297:R297)","v":0}]
[{"$nulls":11},"Min"]
[{"$nulls":11},"Max"]
{"$rows_empty":13}
[19,{"$nulls":4},"Trolig","Min","Max","Källa ","Ev. kommentar",null,null,{"$f":"Startår","v":2020},{"$f":"M311+1","v":2021},{"$f":"N311+1","v":2022},{"$f":"O311+1","v":2023},{"$f":"P311+1","v":2024},{"$f":"Q311+1","v":2025},"Summa trolig","Summa min","Summa max"]
[{"$nulls":11},"Trolig",{"$nulls":6},{"$f":"SUM(M312:R312)","v":0},{"$f":"SUM(M313:R313)","v":0},{"$f":"SUM(M314:R314)","v":0}]
[{"$nulls":11},"Min"]
[{"$nulls":11},"Max"]
{"$rows_empty":13}
[20,{"$nulls":4},"Trolig","Min","Max","Källa ","Säkerhet",null,null,{"$f":"Startår","v":2020},{"$f":"M328+1","v":2021},{"$f":"N328+1","v":2022},{"$f":"O328+1","v":2023},{"$f":"P328+1","v":2024},{"$f":"Q328+1","v":2025},"Summa trolig","Summa min","Summa max"]
[{"$nulls":11},"Trolig",{"$nulls":6},{"$f":"SUM(M329:R329)","v":0},{"$f":"SUM(M330:R330)","v":0},{"$f":"SUM(M331:R331)","v":0}]
[{"$nulls":11},"Min"]
[{"$nulls":11},"Max"]
{"$rows_empty":13}
[21,{"$nulls":4},"Trolig","Min","Max","Källa ","Säkerhet",null,null,{"$f":"Startår","v":2020},{"$f":"M345+1","v":2021},{"$f":"N345+1","v":2022},{"$f":"O345+1","v":2023},{"$f":"P345+1","v":2024},{"$f":"Q345+1","v":2025},"Summa trolig","Summa min","Summa max"]
[{"$nulls":11},"Trolig",{"$nulls":6},{"$f":"SUM(M346:R346)","v":0},{"$f":"SUM(M347:R347)","v":0},{"$f":"SUM(M348:R348)","v":0}]
[{"$nulls":11},"Min"]
[{"$nulls":11},"Max"]

{"sheet":"Nyttor","index":2,"n_rows":28,"n_cols":16,"rows_kept":28,"merged":[[3,5,3,10],[3,12,3,13]]}
[null,"Nyttor"]
[null,{"$f":"IF(Försättsblad!B6=0,\"\",Försättsblad!B6)","v":"UX-ramverket"}]
[]
[null,null,"Välj finansiell nytta, en omfördelningsnytta, eller kvalitativ, mätbar. ","Ange ett kortfattat men beskrivande namn på nyttan, exempelvis \"minskad restid\",  \"reducerad personalkostnad\", etc.","Ange för vilken intressent nyttan uppstår. ","För finansiella nyttor och omfördelningsnyttor, ange det uppskattade värdet per år under realiseringsperioden. ",{"$nulls":6},"Om möjligt estimera ett min- och ett max värde."]
[{"$nulls":5},{"$f":"Startår","v":2020},{"$f":"F5+1","v":2021},{"$f":"G5+1","v":2022},2023,2024,2025]
[null,"ID","Nyttokategori","Nyttans namn","Intressent ","år 1","år 2","år 3","år 4","år 5","år 6","Summa","Min","Max","Vägt medel","Osäkerhet"]
[null,1,"2. Omfördelningsnytta",{"$f":"'Räkna på nyttorna'!C5","v":"Frigjord tid för front-end utveckling"},"Inera",{"$f":"'Räkna på nyttorna'!M6","v":0},{"$f":"'Räkna på nyttorna'!N6","v":{"v":16000000,"d":"16,000,000 "}},{"$f":"'Räkna på nyttorna'!O6","v":{"v":16000000,"d":"16,000,000 "}},{"$f":"'Räkna på nyttorna'!P6","v":{"v":16000000,"d":"16,000,000 "}},{"$f":"'Räkna på nyttorna'!Q6","v":{"v":16000000,"d":"16,000,000 "}},{"$f":"'Räkna på nyttorna'!R6","v":{"v":16000000,"d":"16,000,000 "}},{"$f":"'Räkna på nyttorna'!S6","v":{"v":80000000,"d":"80,000,000 "}},{"$f":"'Räkna på nyttorna'!T6","v":{"v":21000000,"d":"21,000,000 "}},{"$f":"'Räkna på nyttorna'!U6","v":{"v":150000000,"d":"150,000,000 "}},{"$f":"IF(OR(ISBLANK(N7),ISBLANK(M7),ISBLANK(L7)),\"\",(N7+M7+3*L7)/5)","v":{"v":82200000,"d":"82,200,000 "}},{"$f":"IF(OR(ISBLANK(L7),L7=0),\"\",(N7-M7)/5/L7)","v":{"v":0.3225,"d":"32%"}}]
[null,2,"2. Omfördelningsnytta",{"$f":"'Räkna på nyttorna'!C22","v":"Frigjord tid för UX"},"Inera",{"$f":"'Räkna på nyttorna'!M23","v":0},{"$f":"'Räkna på nyttorna'!N23","v":{"v":6400000,"d":"6,400,000 "}},{"$f":"'Räkna på nyttorna'!O23","v":{"v":6400000,"d":"6,400,000 "}},{"$f":"'Räkna på nyttorna'!P23","v":{"v":6400000,"d":"6,400,000 "}},{"$f":"'Räkna på nyttorna'!Q23","v":{"v":6400000,"d":"6,400,000 "}},{"$f":"'Räkna på nyttorna'!R23","v":{"v":6400000,"d":"6,400,000 "}},{"$f":"'Räkna på nyttorna'!S23","v":{"v":32000000,"d":"32,000,000 "}},{"$f":"'Räkna på nyttorna'!T23","v":{"v":7000000,"d":"7,000,000 "}},{"$f":"'Räkna på nyttorna'!U23","v":{"v":75000000,"d":"75,000,000 "}},{"v":35600000,"d":"35,600,000 "},{"v":0.425,"d":"43%"}]
[null,3,"2. Omfördelningsnytta",{"$f":"'Räkna på nyttorna'!C39","v":"Frigjord tid för utvecklare som åtgärdar användbarhetsproblem i efterhand"},"Inera",{"$f":"'Räkna på nyttorna'!M40","v":0},{"$f":"'Räkna på nyttorna'!N40","v":0},{"$f":"'Räkna på nyttorna'!O40","v":{"v":3240000,"d":"3,240,000 "}},{"$f":"'Räkna på nyttorna'!P40","v":{"v":3240000,"d":"3,240,000 "}},{"$f":"'Räkna på nyttorna'!Q40","v":{"v":3240000,"d":"3,240,000 "}},{"$f":"'Räkna på nyttorna'!R40","v":{"v":3240000,"d":"3,240,000 "}},{"$f":"'Räkna på nyttorna'!S40","v":{"v":12960000,"d":"12,960,000 "}},{"$f":"'Räkna på nyttorna'!T40","v":{"v":6912000,"d":"6,912,000 "}},{"$f":"'Räkna på nyttorna'!U40","v":{"v":20160000,"d":"20,160,000 "}},{"v":13190400,"d":"13,190,400 "},{"v":0.20444444444444446,"d":"20%"}]
[null,4,"2. Omfördelningsnytta",{"$f":"'Räkna på nyttorna'!C56","v":"Frigjord tid för Ineras kundtjänst"},"Inera",{"$f":"'Räkna på nyttorna'!M57","v":0},{"$f":"'Räkna på nyttorna'!N57","v":0},{"$f":"'Räkna på nyttorna'!O57","v":{"v":700000,"d":"700,000 "}},{"$f":"'Räkna på nyttorna'!P57","v":{"v":700000,"d":"700,000 "}},{"$f":"'Räkna på nyttorna'!Q57","v":{"v":700000,"d":"700,000 "}},{"$f":"'Räkna på nyttorna'!R57","v":{"v":700000,"d":"700,000 "}},{"$f":"'Räkna på nyttorna'!S57","v":{"v":2800000,"d":"2,800,000 "}},{"$f":"'Räkna på nyttorna'!T57","v":{"v":1400000,"d":"1,400,000 "}},{"$f":"'Räkna på nyttorna'!U57","v":{"v":4200000,"d":"4,200,000 "}},{"v":2800000,"d":"2,800,000 "},{"v":0.2,"d":"20%"}]
[null,5,"2. Omfördelningsnytta",{"$f":"'Räkna på nyttorna'!C73","v":"Frigjord tid för invånare genom ökad användbarhet - exempel inloggning 1177.se"},"Invånare",{"$f":"'Räkna på nyttorna'!M74","v":0},{"$f":"'Räkna på nyttorna'!N74","v":{"v":27222222.22222222,"d":"27,222,222 "}},{"$f":"'Räkna på nyttorna'!O74","v":{"v":27222222.22222222,"d":"27,222,222 "}},{"$f":"'Räkna på nyttorna'!P74","v":{"v":27222222.22222222,"d":"27,222,222 "}},{"$f":"'Räkna på nyttorna'!Q74","v":{"v":27222222.22222222,"d":"27,222,222 "}},{"$f":"'Räkna på nyttorna'!R74","v":{"v":27222222.22222222,"d":"27,222,222 "}},{"$f":"'Räkna på nyttorna'!S74","v":{"v":136111111.1111111,"d":"136,111,111 "}},{"$f":"'Räkna på nyttorna'!T74","v":{"v":97222222.22222222,"d":"97,222,222 "}},{"$f":"'Räkna på nyttorna'!U74","v":{"v":175000000,"d":"175,000,000 "}},{"v":136111111.1111111,"d":"136,111,111 "},{"v":0.1142857142857143,"d":"11%"}]
[null,6,null,{"$f":"'Räkna på nyttorna'!C90","v":0},null,{"$f":"'Räkna på nyttorna'!M91","v":0},{"$f":"'Räkna på nyttorna'!N91","v":0},{"$f":"'Räkna på nyttorna'!O91","v":0},{"$f":"'Räkna på nyttorna'!P91","v":0},{"$f":"'Räkna på nyttorna'!Q91","v":0},{"$f":"'Räkna på nyttorna'!R91","v":0},{"$f":"'Räkna på nyttorna'!S91","v":0},{"$f":"'Räkna på nyttorna'!T91","v":0},{"$f":"'Räkna på nyttorna'!U91","v":0},0,""]
[null,7,null,{"$f":"'Räkna på nyttorna'!C107","v":0},null,{"$f":"'Räkna på nyttorna'!M108","v":0},{"$f":"'Räkna på nyttorna'!N108","v":0},{"$f":"'Räkna på nyttorna'!O108","v":0},{"$f":"'Räkna på nyttorna'!P108","v":0},{"$f":"'Räkna på nyttorna'!Q108","v":0},{"$f":"'Räkna på nyttorna'!R108","v":0},{"$f":"'Räkna på nyttorna'!S108","v":0},{"$f":"'Räkna på nyttorna'!T108","v":0},{"$f":"'Räkna på nyttorna'!U108","v":0},0,""]
[null,8,null,{"$f":"'Räkna på nyttorna'!C124","v":0},null,{"$f":"'Räkna på nyttorna'!M125","v":0},{"$f":"'Räkna på nyttorna'!N125","v":0},{"$f":"'Räkna på nyttorna'!O125","v":0},{"$f":"'Räkna på nyttorna'!P125","v":0},{"$f":"'Räkna på nyttorna'!Q125","v":0},{"$f":"'Räkna på nyttorna'!R125","v":0},{"$f":"'Räkna på nyttorna'!S125","v":0},{"$f":"'Räkna på nyttorna'!T125","v":0},{"$f":"'Räkna på nyttorna'!U125","v":0},0,""]
[null,9,null,{"$f":"'Räkna på nyttorna'!C141","v":0},null,{"$f":"'Räkna på nyttorna'!M142","v":0},{"$f":"'Räkna på nyttorna'!N142","v":0},{"$f":"'Räkna på nyttorna'!O142","v":0},{"$f":"'Räkna på nyttorna'!P142","v":0},{"$f":"'Räkna på nyttorna'!Q142","v":0},{"$f":"'Räkna på nyttorna'!R142","v":0},{"$f":"'Räkna på nyttorna'!S142","v":0},{"$f":"'Räkna på nyttorna'!T126","v":0},{"$f":"'Räkna på nyttorna'!U142","v":0},0,""]
[null,10,null,{"$f":"'Räkna på nyttorna'!C158","v":0},null,{"$f":"'Räkna på nyttorna'!M159","v":0},{"$f":"'Räkna på nyttorna'!N159","v":0},{"$f":"'Räkna på nyttorna'!O159","v":0},{"$f":"'Räkna på nyttorna'!P159","v":0},{"$f":"'Räkna på nyttorna'!Q159","v":0},{"$f":"'Räkna på nyttorna'!R159","v":0},{"$f":"'Räkna på nyttorna'!S159","v":0},{"$f":"'Räkna på nyttorna'!T127","v":0},{"$f":"'Räkna på nyttorna'!U159","v":0},0,""]
[null,11,null,{"$f":"'Räkna på nyttorna'!C175","v":0},null,{"$f":"'Räkna på nyttorna'!M176","v":0},{"$f":"'Räkna på nyttorna'!N176","v":0},{"$f":"'Räkna på nyttorna'!O176","v":0},{"$f":"'Räkna på nyttorna'!P176","v":0},{"$f":"'Räkna på nyttorna'!Q176","v":0},{"$f":"'Räkna på nyttorna'!R176","v":0},{"$f":"'Räkna på nyttorna'!S176","v":0},{"$f":"'Räkna på nyttorna'!T176","v":0},{"$f":"'Räkna på nyttorna'!U176","v":0},0,""]
[null,12,null,{"$f":"'Räkna på nyttorna'!C192","v":0},null,{"$f":"'Räkna på nyttorna'!M193","v":0},{"$f":"'Räkna på nyttorna'!N193","v":0},{"$f":"'Räkna på nyttorna'!O193","v":0},{"$f":"'Räkna på nyttorna'!P193","v":0},{"$f":"'Räkna på nyttorna'!Q193","v":0},{"$f":"'Räkna på nyttorna'!R193","v":0},{"$f":"'Räkna på nyttorna'!S193","v":0},{"$f":"'Räkna på nyttorna'!T193","v":0},{"$f":"'Räkna på nyttorna'!U193","v":0},0,""]
[null,13,null,{"$f":"'Räkna på nyttorna'!C209","v":0},null,{"$f":"'Räkna på nyttorna'!M210","v":0},{"$f":"'Räkna på nyttorna'!N210","v":0},{"$f":"'Räkna på nyttorna'!O210","v":0},{"$f":"'Räkna på nyttorna'!P210","v":0},{"$f":"'Räkna på nyttorna'!Q210","v":0},{"$f":"'Räkna på nyttorna'!R210","v":0},{"$f":"'Räkna på nyttorna'!S210","v":0},{"$f":"'Räkna på nyttorna'!T210","v":0},{"$f":"'Räkna på nyttorna'!U210","v":0},0,""]
[null,14,null,{"$f":"'Räkna på nyttorna'!C226","v":0},null,{"$f":"'Räkna på nyttorna'!M227","v":0},{"$f":"'Räkna på nyttorna'!N227","v":0},{"$f":"'Räkna på nyttorna'!O227","v":0},{"$f":"'Räkna på nyttorna'!P227","v":0},{"$f":"'Räkna på nyttorna'!Q227","v":0},{"$f":"'Räkna på nyttorna'!R227","v":0},{"$f":"'Räkna på nyttorna'!S227","v":0},{"$f":"'Räkna på nyttorna'!T227","v":0},{"$f":"'Räkna på nyttorna'!U227","v":0},0,""]
[null,15,null,{"$f":"'Räkna på nyttorna'!C243","v":0},null,{"$f":"'Räkna på nyttorna'!M244","v":0},{"$f":"'Räkna på nyttorna'!N244","v":0},{"$f":"'Räkna på nyttorna'!O244","v":0},{"$f":"'Räkna på nyttorna'!P244","v":0},{"$f":"'Räkna på nyttorna'!Q244","v":0},{"$f":"'Räkna på nyttorna'!R244","v":0},{"$f":"'Räkna på nyttorna'!S244","v":0},{"$f":"'Räkna på nyttorna'!T244","v":0},{"$f":"'Räkna på nyttorna'!U244","v":0},0,""]
[null,16,null,{"$f":"'Räkna på nyttorna'!C260","v":0},null,{"$f":"'Räkna på nyttorna'!M261","v":0},{"$f":"'Räkna på nyttorna'!N261","v":0},{"$f":"'Räkna på nyttorna'!O261","v":0},{"$f":"'Räkna på nyttorna'!P261","v":0},{"$f":"'Räkna på nyttorna'!Q261","v":0},{"$f":"'Räkna på nyttorna'!R261","v":0},{"$f":"'Räkna på nyttorna'!S261","v":0},{"$f":"'Räkna på nyttorna'!T261","v":0},{"$f":"'Räkna på nyttorna'!U261","v":0},0,""]
[null,17,null,{"$f":"'Räkna på nyttorna'!C277","v":0},null,{"$f":"'Räkna på nyttorna'!M278","v":0},{"$f":"'Räkna på nyttorna'!N278","v":0},{"$f":"'Räkna på nyttorna'!O278","v":0},{"$f":"'Räkna på nyttorna'!P278","v":0},{"$f":"'Räkna på nyttorna'!Q278","v":0},{"$f":"'Räkna på nyttorna'!R278","v":0},{"$f":"'Räkna på nyttorna'!S278","v":0},{"$f":"'Räkna på nyttorna'!T278","v":0},{"$f":"'Räkna på nyttorna'!U278","v":0},0,""]
[null,18,null,{"$f":"'Räkna på nyttorna'!C294","v":0},null,{"$f":"'Räkna på nyttorna'!M295","v":0},{"$f":"'Räkna på nyttorna'!N295","v":0},{"$f":"'Räkna på nyttorna'!O295","v":0},{"$f":"'Räkna på nyttorna'!P295","v":0},{"$f":"'Räkna på nyttorna'!Q295","v":0},{"$f":"'Räkna på nyttorna'!R295","v":0},{"$f":"'Räkna på nyttorna'!S295","v":0},{"$f":"'Räkna på nyttorna'!T295","v":0},{"$f":"'Räkna på nyttorna'!U295","v":0},0,""]
[null,19,null,{"$f":"'Räkna på nyttorna'!C311","v":0},null,{"$f":"'Räkna på nyttorna'!M312","v":0},{"$f":"'Räkna på nyttorna'!N312","v":0},{"$f":"'Räkna på nyttorna'!O312","v":0},{"$f":"'Räkna på nyttorna'!P312","v":0},{"$f":"'Räkna på nyttorna'!Q312","v":0},{"$f":"'Räkna på nyttorna'!R312","v":0},{"$f":"'Räkna på nyttorna'!S312","v":0},{"$f":"'Räkna på nyttorna'!T312","v":0},{"$f":"'Räkna på nyttorna'!U312","v":0},0,""]
[null,20,null,{"$f":"'Räkna på nyttorna'!C328","v":0},null,{"$f":"'Räkna på nyttorna'!M329","v":0},{"$f":"'Räkna på nyttorna'!N329","v":0},{"$f":"'Räkna på nyttorna'!O329","v":0},{"$f":"'Räkna på nyttorna'!P329","v":0},{"$f":"'Räkna på nyttorna'!Q329","v":0},{"$f":"'Räkna på nyttorna'!R329","v":0},{"$f":"'Räkna på nyttorna'!S329","v":0},{"$f":"'Räkna på nyttorna'!T329","v":0},{"$f":"'Räkna på nyttorna'!U329","v":0},0,""]
[null,21,null,{"$f":"'Räkna på nyttorna'!K346","v":0},null,{"$f":"'Räkna på nyttorna'!M346","v":0},{"$f":"'Räkna på nyttorna'!N346","v":0},{"$f":"'Räkna på nyttorna'!O346","v":0},{"$f":"'Räkna på nyttorna'!P346","v":0},{"$f":"'Räkna på nyttorna'!Q346","v":0},{"$f":"'Räkna på nyttorna'!R346","v":0},{"$f":"'Räkna på nyttorna'!S346","v":0},{"$f":"'Räkna på nyttorna'!T346","v":0},{"$f":"'Räkna på nyttorna'!U346","v":0},0,""]
[null,"Summa",{"$nulls":3},{"$f":"SUBTOTAL(109,Nyttor[år 1])","v":0},{"$f":"SUBTOTAL(109,Nyttor[år 2])","v":{"v":49622222.222222224,"d":"49,622,222 "}},{"$f":"SUBTOTAL(109,Nyttor[år 3])","v":{"v":53562222.222222224,"d":"53,562,222 "}},{"$f":"SUBTOTAL(109,Nyttor[år 4])","v":{"v":53562222.222222224,"d":"53,562,222 "}},{"$f":"SUBTOTAL(109,Nyttor[år 5])","v":{"v":53562222.222222224,"d":"53,562,222 "}},{"$f":"SUBTOTAL(109,Nyttor[år 6])","v":{"v":53562222.222222224,"d":"53,562,222 "}},{"$f":"SUBTOTAL(109,Nyttor[Summa])","v":{"v":263871111.1111111,"d":"263,871,111 "}},{"$f":"SUM(Nyttor[Min])","v":{"v":133534222.22222222,"d":"133,534,222 "}},{"$f":"SUM(Nyttor[Max])","v":{"v":424360000,"d":"424,360,000 "}},{"$f":"SUBTOTAL(109,Nyttor[Vägt medel])","v":{"v":269901511.1111111,"d":"269,901,511 "}}]

{"sheet":"Kostnader","index":3,"n_rows":32,"n_cols":16,"rows_kept":32,"merged":[[3,5,3,11],[3,12,3,13]]}
[null,"Kostnader"]
[null,{"$f":"IF(Försättsblad!B6=0,\"\",Försättsblad!B6)","v":"UX-ramverket"}]
[]
[null,null,"Ange kostnadskategori - genom att välja i rullisten. ","Ange ett kortfattat men beskrivande namn på kostnaden, exempelvis \"personalkostnad, \"konsultkostnad,\" etc. ","Angeför vilken intressent kostnaden uppstår. Ange en ny rad per intressent om kostnaden uppstår hos fler intressenter. ","Skriv kostnaden per år. ",{"$nulls":6},"Om möjligt estimera ett min- och ett max värde."]
[{"$nulls":5},{"$f":"Startår","v":2020},{"$f":"F5+1","v":2021},{"$f":"G5+1","v":2022},2023,2024,2025]
[null,"ID","Kostnadskategori","Kostnadens namn","Intressent ","år 1","år 2","år 3","år 4","år 5","år 6","Summa","Min","Max","Vägt medel","Osäkerhet"]
[null,1,"4. Projekt","UX-ramverket fas 1","Inera",{"v":1400000,"d":"1,400,000 "},{"$nulls":5},{"$f":"SUM(F7:K7)","v":{"v":1400000,"d":"1,400,000 "}},{"$f":"0.8*Kostnader[[#This Row],[Summa]]","v":{"v":1120000,"d":"1,120,000 "}},{"$f":"1.2*Kostnader[[#This Row],[Min]]","v":{"v":1344000,"d":"1,344,000 "}},{"$f":"IF(OR(ISBLANK(N7),ISBLANK(M7),ISBLANK(L7)),\"\",(N7+M7+3*L7)/5)","v":{"v":1332800,"d":"1,332,800 "}},{"$f":"IF(OR(ISBLANK(L7),L7=0),\"\",(N7-M7)/5/L7)","v":{"v":0.032,"d":"3%"}}]
[null,2,"4. Projekt","Ux-ramverket fas 2","Inera",{"v":1400000,"d":"1,400,000 "},{"$nulls":5},{"v":1400000,"d":"1,400,000 "},{"$f":"0.8*Kostnader[[#This Row],[Summa]]","v":{"v":1120000,"d":"1,120,000 "}},{"$f":"1.2*Kostnader[[#This Row],[Min]]","v":{"v":1344000,"d":"1,344,000 "}},{"v":1332800,"d":"1,332,800 "},{"v":0.032,"d":"3%"}]
[null,3,"4. Projekt","UX-ramverket fas 3","Inera",null,{"v":2000000,"d":"2,000,000 "},{"$nulls":4},{"v":2000000,"d":"2,000,000 "},{"$f":"0.8*Kostnader[[#This Row],[Summa]]","v":{"v":1600000,"d":"1,600,000 "}},{"$f":"1.2*Kostnader[[#This Row],[Min]]","v":{"v":1920000,"d":"1,920,000 "}},{"v":1904000,"d":"1,904,000 "},{"v":0.032,"d":"3%"}]
[null,4,"2. Löpande verksamhetskostnader","Förvaltning","Inera",null,null,{"v":1400000,"d":"1,400,000 "},{"v":1800000,"d":"1,800,000 "},{"v":1800000,"d":"1,800,000 "},{"v":1800000,"d":"1,800,000 "},{"v":6800000,"d":"6,800,000 "},{"$f":"0.8*Kostnader[[#This Row],[Summa]]","v":{"v":5440000,"d":"5,440,000 "}},{"$f":"1.2*Kostnader[[#This Row],[Min]]","v":{"v":6528000,"d":"6,528,000 "}},{"v":6473600,"d":"6,473,600 "},{"v":0.032,"d":"3%"}]
[null,5,{"$nulls":9},0,{"$f":"0.8*Kostnader[[#This Row],[Summa]]","v":0},{"$f":"1.2*Kostnader[[#This Row],[Min]]","v":0},0,""]
[null,6,{"$nulls":9},0,{"$f":"0.8*Kostnader[[#This Row],[Summa]]","v":0},{"$f":"1.2*Kostnader[[#This Row],[Min]]","v":0},0,""]
[null,7,{"$nulls":9},0,{"$f":"0.8*Kostnader[[#This Row],[Summa]]","v":0},{"$f":"1.2*Kostnader[[#This Row],[Min]]","v":0},0,""]
[null,8,{"$nulls":9},0,{"$f":"0.8*Kostnader[[#This Row],[Summa]]","v":0},{"$f":"1.2*Kostnader[[#This Row],[Min]]","v":0},0,""]
[null,9,{"$nulls":9},0,{"$f":"0.8*Kostnader[[#This Row],[Summa]]","v":0},{"$f":"1.2*Kostnader[[#This Row],[Min]]","v":0},0,""]
[null,10,{"$nulls":9},0,{"$f":"0.8*Kostnader[[#This Row],[Summa]]","v":0},{"$f":"1.2*Kostnader[[#This Row],[Min]]","v":0},0,""]
[null,11,{"$nulls":9},0,{"$f":"0.8*Kostnader[[#This Row],[Summa]]","v":0},{"$f":"1.2*Kostnader[[#This Row],[Min]]","v":0},0,""]
[null,12,{"$nulls":9},0,{"$f":"0.8*Kostnader[[#This Row],[Summa]]","v":0},{"$f":"1.2*Kostnader[[#This Row],[Min]]","v":0},0,""]
[null,13,{"$nulls":9},0,{"$f":"0.8*Kostnader[[#This Row],[Summa]]","v":0},{"$f":"1.2*Kostnader[[#This Row],[Min]]","v":0},0,""]
[null,14,{"$nulls":9},0,{"$f":"0.8*Kostnader[[#This Row],[Summa]]","v":0},{"$f":"1.2*Kostnader[[#This Row],[Min]]","v":0},0,""]
[null,15,{"$nulls":9},0,{"$f":"0.8*Kostnader[[#This Row],[Summa]]","v":0},{"$f":"1.2*Kostnader[[#This Row],[Min]]","v":0},0,""]
[null,16,{"$nulls":9},0,{"$f":"0.8*Kostnader[[#This Row],[Summa]]","v":0},{"$f":"1.2*Kostnader[[#This Row],[Min]]","v":0},0,""]
[null,17,{"$nulls":9},0,{"$f":"0.8*Kostnader[[#This Row],[Summa]]","v":0},{"$f":"1.2*Kostnader[[#This Row],[Min]]","v":0},0,""]
[null,18,{"$nulls":9},0,{"$f":"0.8*Kostnader[[#This Row],[Summa]]","v":0},{"$f":"1.2*Kostnader[[#This Row],[Min]]","v":0},0,""]
[null,19,{"$nulls":9},0,{"$f":"0.8*Kostnader[[#This Row],[Summa]]","v":0},{"$f":"1.2*Kostnader[[#This Row],[Min]]","v":0},0,""]
[null,20,{"$nulls":9},0,{"$f":"0.8*Kostnader[[#This Row],[Summa]]","v":0},{"$f":"1.2*Kostnader[[#This Row],[Min]]","v":0},0,""]
[null,21,{"$nulls":9},0,{"$f":"0.8*Kostnader[[#This Row],[Summa]]","v":0},{"$f":"1.2*Kostnader[[#This Row],[Min]]","v":0},0,""]
[null,"Summa",{"$nulls":3},{"$f":"SUBTOTAL(109,Kostnader[år 1])","v":{"v":2800000,"d":"2,800,000 "}},{"$f":"SUBTOTAL(109,Kostnader[år 2])","v":{"v":2000000,"d":"2,000,000 "}},{"$f":"SUBTOTAL(109,Kostnader[år 3])","v":{"v":1400000,"d":"1,400,000 "}},{"$f":"SUBTOTAL(109,Kostnader[år 4])","v":{"v":1800000,"d":"1,800,000 "}},{"$f":"SUBTOTAL(109,Kostnader[år 5])","v":{"v":1800000,"d":"1,800,000 "}},{"$f":"SUBTOTAL(109,Kostnader[år 6])","v":{"v":1800000,"d":"1,800,000 "}},{"$f":"SUBTOTAL(109,Kostnader[Summa])","v":{"v":11600000,"d":"11,600,000 "}},{"$f":"SUBTOTAL(109,Kostnader[Min])","v":{"v":9280000,"d":"9,280,000 "}},{"$f":"SUBTOTAL(109,Kostnader[Max])","v":{"v":11136000,"d":"11,136,000 "}},{"$f":"SUBTOTAL(109,Kostnader[Vägt medel])","v":{"v":11043200,"d":"11,043,200 "}}]
[]
[{"$nulls":9},"Total snittkostnad per år",null,{"$f":"Kostnader[[#Totals],[Summa]]/6","v":{"v":1933333.3333333333,"d":"1,933,333 "}}]
[]
[{"$nulls":9},"Projektkostnad totalt",null,{"$f":"L7+L8+L9","v":{"v":4800000,"d":"4,800,000 "}}]

{"sheet":"Nyttokalkyl","index":4,"n_rows":123,"n_cols":16,"rows_kept":123,"merged":[[8,3,8,4],[20,3,22,4],[59,3,59,4],[110,3,110,4]]}
[{"$nulls":3},"Nyttokalkyl"]
[{"$nulls":3},{"$f":"IF(Försättsblad!B6=0,\"\",Försättsblad!B6)","v":"UX-ramverket"}]
[{"$nulls":3},"Tabellerna och diagrammen är formaterade för att passa i powerpoint-presentationer. "]
[{"$nulls":3},"Markera och kopiera tabellen eller diagrammet och välj att \"klistra in som bild\" för ett snyggt resultat."]
[]
[{"$nulls":3},"Total nytta"]
[]
[]
[{"$nulls":3},"Nyttorealiseringskalkyl - total nytta",{"$nulls":4},"Nyttorealiseringskalkyl - total nytta"]
[{"$nulls":3},"För perioden",{"$f":"Startår & \" - \" & Startår+5","v":"2020 - 2025"}]
[{"$nulls":9},{"$f":"Startår","v":2020},{"$f":"J11+1","v":2021},{"$f":"K11+1","v":2022},2023,{"$f":"M11+1","v":2024},{"$f":"N11+1","v":2025},"Totalt"]
[{"$nulls":3},"Total kostnad",{"$f":"TotalKostnad","v":{"v":-11600000,"d":"-11,600,000 kr"}},{"$nulls":3},"Total nytta",{"$f":"J13+J14","v":0},{"$f":"K13+K14","v":{"v":22400000,"d":"22,400,000 "}},{"v":26340000,"d":"26,340,000 "},{"v":26340000,"d":"26,340,000 "},{"v":26340000,"d":"26,340,000 "},{"v":26340000,"d":"26,340,000 "},{"v":127760000,"d":"127,760,000 "}]
[{"$nulls":3},"Finansiell nytta",{"$f":"P13","v":0},{"$nulls":3},"Finansiella nyttor",{"$f":"IFERROR(GETPIVOTDATA(\"Summa av år 1\",'-Admin-'!$C$25,\"Nyttokategori\",\"1. Finansiell\"),0)","v":0},{"$f":"IFERROR(GETPIVOTDATA(\"Summa av år 2\",'-Admin-'!$C$25,\"Nyttokategori\",\"1. Finansiell\"),0)","v":0},{"$f":"IFERROR(GETPIVOTDATA(\"Summa av år 3\",'-Admin-'!$C$25,\"Nyttokategori\",\"1. Finansiell\"),0)","v":0},{"$f":"IFERROR(GETPIVOTDATA(\"Summa av år 4\",'-Admin-'!$C$25,\"Nyttokategori\",\"1. Finansiell\"),0)","v":0},{"$f":"IFERROR(GETPIVOTDATA(\"Summa av år 5\",'-Admin-'!$C$25,\"Nyttokategori\",\"1. Finansiell\"),0)","v":0},{"$f":"IFERROR(GETPIVOTDATA(\"Summa av år 6\",'-Admin-'!$C$25,\"Nyttokategori\",\"1. Finansiell\"),0)","v":0},{"$f":"SUM(J13:O13)","v":0}]
[{"$nulls":3},"Omfördelningsnytta",{"$f":"P14","v":{"v":127760000,"d":"127,760,000 kr"}},{"$nulls":3},"Omfördelningsnyttor",{"$f":"IFERROR(GETPIVOTDATA(\"Summa av år 1\",'-Admin-'!$C$25,\"Nyttokategori\",\"2. Omfördelningsnytta\"),0)","v":0},{"$f":"IFERROR(GETPIVOTDATA(\"Summa av år 2\",'-Admin-'!$C$25,\"Nyttokategori\",\"2. Omfördelningsnytta\"),0)","v":{"v":22400000,"d":"22,400,000 "}},{"$f":"IFERROR(GETPIVOTDATA(\"Summa av år 3\",'-Admin-'!$C$25,\"Nyttokategori\",\"2. Omfördelningsnytta\"),0)","v":{"v":26340000,"d":"26,340,000 "}},{"$f":"IFERROR(GETPIVOTDATA(\"Summa av år 4\",'-Admin-'!$C$25,\"Nyttokategori\",\"2. Omfördelningsnytta\"),0)","v":{"v":26340000,"d":"26,340,000 "}},{"$f":"IFERROR(GETPIVOTDATA(\"Summa av år 5\",'-Admin-'!$C$25,\"Nyttokategori\",\"2. Omfördelningsnytta\"),0)","v":{"v":26340000,"d":"26,340,000 "}},{"$f":"IFERROR(GETPIVOTDATA(\"Summa av år 6\",'-Admin-'!$C$25,\"Nyttokategori\",\"2. Omfördelningsnytta\"),0)","v":{"v":26340000,"d":"26,340,000 "}},{"$f":"SUM(J14:O14)","v":{"v":127760000,"d":"127,760,000 "}}]
[{"$nulls":3},"Total nytta",{"$f":"TotalNytta","v":{"v":127760000,"d":"127,760,000 kr"}}]
[{"$nulls":3},"Total nettonytta",{"$f":"NettoNytta","v":{"v":116160000,"d":"116,160,000 kr"}},{"$nulls":3},"Total kostnad",{"$f":"SUM(J17:J20)","v":{"v":-2800000,"d":"-2,800,000 "}},{"$f":"SUM(K17:K20)","v":{"v":-2000000,"d":"-2,000,000 "}},{"v":-1400000,"d":"-1,400,000 "},{"v":-1800000,"d":"-1,800,000 "},{"v":-1800000,"d":"-1,800,000 "},{"v":-1800000,"d":"-1,800,000 "},{"v":-11600000,"d":"-11,600,000 "}]
[{"$nulls":8},"Verksamhets-förändring",{"$f":"IFERROR(-GETPIVOTDATA(\"Summa av År 1\",'-Admin-'!$C$32,\"Kostnadskategori\",\"1. Verksamhetsförändring\"),0)","v":0},{"$f":"IFERROR(-GETPIVOTDATA(\"Summa av År 2\",'-Admin-'!$C$32,\"Kostnadskategori\",\"1. Verksamhetsförändring\"),0)","v":0},{"$f":"IFERROR(-GETPIVOTDATA(\"Summa av År 3\",'-Admin-'!$C$32,\"Kostnadskategori\",\"1. Verksamhetsförändring\"),0)","v":0},{"$f":"IFERROR(-GETPIVOTDATA(\"Summa av År 4\",'-Admin-'!$C$32,\"Kostnadskategori\",\"1. Verksamhetsförändring\"),0)","v":0},{"$f":"IFERROR(-GETPIVOTDATA(\"Summa av År 5\",'-Admin-'!$C$32,\"Kostnadskategori\",\"1. Verksamhetsförändring\"),0)","v":0},{"$f":"IFERROR(GETPIVOTDATA(\"Summa av År 6\",'-Admin-'!$C$32,\"Kostnadskategori\",\"1. Verksamhetsförändring\"),0)","v":0},{"$f":"SUM(J17:O17)","v":0}]
[{"$nulls":3},"Return on investment (ROI)",{"$f":"IF(-TotalKostnad=0,0,TotalNettoNytta/-TotalKostnad)","v":{"v":10.013793103448275,"d":"10.01 kr"}},{"$nulls":3},"Löpande verksamhets-kostnader",{"$f":"IFERROR(-GETPIVOTDATA(\"Summa av År 1\",'-Admin-'!$C$32,\"Kostnadskategori\",\"2. Löpande verksamhetskostnader\"),0)","v":0},{"$f":"IFERROR(-GETPIVOTDATA(\"Summa av År 2\",'-Admin-'!$C$32,\"Kostnadskategori\",\"2. Löpande verksamhetskostnader\"),0)","v":0},{"$f":"IFERROR(-GETPIVOTDATA(\"Summa av År 3\",'-Admin-'!$C$32,\"Kostnadskategori\",\"2. Löpande verksamhetskostnader\"),0)","v":{"v":-1400000,"d":"-1,400,000 "}},{"$f":"IFERROR(-GETPIVOTDATA(\"Summa av År 4\",'-Admin-'!$C$32,\"Kostnadskategori\",\"2. Löpande verksamhetskostnader\"),0)","v":{"v":-1800000,"d":"-1,800,000 "}},{"$f":"IFERROR(-GETPIVOTDATA(\"Summa av År 5\",'-Admin-'!$C$32,\"Kostnadskategori\",\"2. Löpande verksamhetskostnader\"),0)","v":{"v":-1800000,"d":"-1,800,000 "}},{"$f":"IFERROR(-GETPIVOTDATA(\"Summa av År 6\",'-Admin-'!$C$32,\"Kostnadskategori\",\"2. Löpande verksamhetskostnader\"),0)","v":{"v":-1800000,"d":"-1,800,000 "}},{"$f":"SUM(J18:O18)","v":{"v":-6800000,"d":"-6,800,000 "}}]
[{"$nulls":3},"Payback-år",{"$f":"IF('-Admin-'!D103=0,\"Ingen payback\",'-Admin-'!D103)","v":2021},{"$nulls":3},"Investeringar",{"$f":"IFERROR(-GETPIVOTDATA(\"Summa av År 1\",'-Admin-'!$C$32,\"Kostnadskategori\",\"3. Investeringar\"),0)","v":0},{"$f":"IFERROR(-GETPIVOTDATA(\"Summa av År 2\",'-Admin-'!$C$32,\"Kostnadskategori\",\"3. Investeringar\"),0)","v":0},{"$f":"IFERROR(-GETPIVOTDATA(\"Summa av År 3\",'-Admin-'!$C$32,\"Kostnadskategori\",\"3. Investeringar\"),0)","v":0},{"$f":"IFERROR(-GETPIVOTDATA(\"Summa av År 4\",'-Admin-'!$C$32,\"Kostnadskategori\",\"3. Investeringar\"),0)","v":0},{"$f":"IFERROR(-GETPIVOTDATA(\"Summa av År 5\",'-Admin-'!$C$32,\"Kostnadskategori\",\"3. Investeringar\"),0)","v":0},{"$f":"IFERROR(-GETPIVOTDATA(\"Summa av År 6\",'-Admin-'!$C$32,\"Kostnadskategori\",\"3. Investeringar\"),0)","v":0},{"$f":"SUM(J19:O19)","v":0}]
[{"$nulls":8},"Projekt",{"$f":"IFERROR(-GETPIVOTDATA(\"Summa av År 1\",'-Admin-'!$C$32,\"Kostnadskategori\",\"4. Projekt\"),0)","v":{"v":-2800000,"d":"-2,800,000 "}},{"$f":"IFERROR(-GETPIVOTDATA(\"Summa av År 2\",'-Admin-'!$C$32,\"Kostnadskategori\",\"4. Projekt\"),0)","v":{"v":-2000000,"d":"-2,000,000 "}},{"$f":"IFERROR(-GETPIVOTDATA(\"Summa av År 3\",'-Admin-'!$C$32,\"Kostnadskategori\",\"4. Projekt\"),0)","v":0},{"$f":"IFERROR(-GETPIVOTDATA(\"Summa av År 4\",'-Admin-'!$C$32,\"Kostnadskategori\",\"4. Projekt\"),0)","v":0},{"$f":"IFERROR(-GETPIVOTDATA(\"Summa av År 5\",'-Admin-'!$C$32,\"Kostnadskategori\",\"4. Projekt\"),0)","v":0},{"$f":"IFERROR(-GETPIVOTDATA(\"Summa av År 6\",'-Admin-'!$C$32,\"Kostnadskategori\",\"4. Projekt\"),0)","v":0},{"v":-4800000,"d":"-4,800,000 "}]
[{"$nulls":3},"Return on investment (ROI) är intjänad värderad nytta per investerad krona. \nPayback-år är året då de värderade nyttorna förväntas överstiga kostnaderna. "]
[{"$nulls":8},"Finansiell nettonytta",{"$f":"J13+J16","v":{"v":-2800000,"d":"-2,800,000 "}},{"$f":"K13+K16","v":{"v":-2000000,"d":"-2,000,000 "}},{"v":-1400000,"d":"-1,400,000 "},{"v":-1800000,"d":"-1,800,000 "},{"v":-1800000,"d":"-1,800,000 "},{"v":-1800000,"d":"-1,800,000 "},{"$f":"P13+P16","v":{"v":-11600000,"d":"-11,600,000 "}}]
[{"$nulls":8},"Ackumulerad finansiell nettonytta",{"$f":"J14+J16","v":{"v":-2800000,"d":"-2,800,000 "}},{"$f":"IF(K22=0,J23,J23+K22)","v":{"v":-4800000,"d":"-4,800,000 "}},{"$f":"IF(L22=0,K23,K23+L22)","v":{"v":-6200000,"d":"-6,200,000 "}},{"$f":"IF(M22=0,L23,L23+M22)","v":{"v":-8000000,"d":"-8,000,000 "}},{"$f":"IF(N22=0,M23,M23+N22)","v":{"v":-9800000,"d":"-9,800,000 "}},{"$f":"IF(O22=0,N23,N23+O22)","v":{"v":-11600000,"d":"-11,600,000 "}},{"$f":"O23","v":{"v":-11600000,"d":"-11,600,000 "}}]
[{"$nulls":8},"Omfördelnings-nettonytta",{"$f":"J14+J16","v":{"v":-2800000,"d":"-2,800,000 "}},{"$f":"K14+K16","v":{"v":20400000,"d":"20,400,000 "}},{"v":24940000,"d":"24,940,000 "},{"v":24540000,"d":"24,540,000 "},{"v":24540000,"d":"24,540,000 "},{"v":24540000,"d":"24,540,000 "},{"$f":"P14+P16","v":{"v":116160000,"d":"116,160,000 "}}]
[{"$nulls":8},"Ackumulerad omfördelnings-nettonytta",{"$f":"J26","v":{"v":-2800000,"d":"-2,800,000 "}},{"$f":"IF(K24=0,J25,J25+K24)","v":{"v":17600000,"d":"17,600,000 "}},{"$f":"IF(L24=0,K25,K25+L24)","v":{"v":42540000,"d":"42,540,000 "}},{"$f":"IF(M24=0,L25,L25+M24)","v":{"v":67080000,"d":"67,080,000 "}},{"$f":"IF(N24=0,M25,M25+N24)","v":{"v":91620000,"d":"91,620,000 "}},{"$f":"IF(O24=0,N25,N25+O24)","v":{"v":116160000,"d":"116,160,000 "}},{"$f":"O25","v":{"v":116160000,"d":"116,160,000 "}}]
[{"$nulls":8},"Nettonytta",{"$f":"J12+J16","v":{"v":-2800000,"d":"-2,800,000 "}},{"v":20400000,"d":"20,400,000 "},{"v":24940000,"d":"24,940,000 "},{"v":24540000,"d":"24,540,000 "},{"v":24540000,"d":"24,540,000 "},{"v":24540000,"d":"24,540,000 "},{"v":116160000,"d":"116,160,000 "}]
[{"$nulls":8},"Ackumulerad nettonytta",{"$f":"J26","v":{"v":-2800000,"d":"-2,800,000 "}},{"$f":"IF(K26=0,J27,J27+K26)","v":{"v":17600000,"d":"17,600,000 "}},{"$f":"IF(L26=0,K27,K27+L26)","v":{"v":42540000,"d":"42,540,000 "}},{"$f":"IF(M26=0,L27,L27+M26)","v":{"v":67080000,"d":"67,080,000 "}},{"$f":"IF(N26=0,M27,M27+N26)","v":{"v":91620000,"d":"91,620,000 "}},{"$f":"IF(O26=0,N27,N27+O26)","v":{"v":116160000,"d":"116,160,000 "}},{"$f":"O27","v":{"v":116160000,"d":"116,160,000 "}}]
{"$rows_empty":29}
[{"$nulls":3},"Finansiell nytta"]
[]
[]
[{"$nulls":3},"Nyttorealiseringskalkyl - finansiel nytta",{"$nulls":4},"Nyttorealiseringskalkyl - finansiell nytta"]
[{"$nulls":3},"För perioden",{"$f":"Startår & \" - \" & Startår+5","v":"2020 - 2025"}]
[{"$nulls":9},{"$f":"Startår","v":2020},{"$f":"J62+1","v":2021},{"$f":"K62+1","v":2022},{"$f":"L62+1","v":2023},{"$f":"M62+1","v":2024},{"$f":"N62+1","v":2025},"Totalt"]
[{"$nulls":3},"Total kostnad",{"$f":"TotalKostnad","v":{"v":-11600000,"d":"-11,600,000 kr"}},{"$nulls":3},"Finansiella nyttor",{"$f":"IFERROR(GETPIVOTDATA(\"Summa av år 1\",'-Admin-'!$C$25,\"Nyttokategori\",\"1. Finansiell\"),0)","v":0},{"$f":"IFERROR(GETPIVOTDATA(\"Summa av år 2\",'-Admin-'!$C$25,\"Nyttokategori\",\"1. Finansiell\"),0)","v":0},{"$f":"IFERROR(GETPIVOTDATA(\"Summa av år 3\",'-Admin-'!$C$25,\"Nyttokategori\",\"1. Finansiell\"),0)","v":0},{"$f":"IFERROR(GETPIVOTDATA(\"Summa av år 4\",'-Admin-'!$C$25,\"Nyttokategori\",\"1. Finansiell\"),0)","v":0},{"$f":"IFERROR(GETPIVOTDATA(\"Summa av år 5\",'-Admin-'!$C$25,\"Nyttokategori\",\"1. Finansiell\"),0)","v":0},{"$f":"IFERROR(GETPIVOTDATA(\"Summa av år 6\",'-Admin-'!$C$25,\"Nyttokategori\",\"1. Finansiell\"),0)","v":0},{"$f":"SUM(J63:O63)","v":0}]
[{"$nulls":3},"Total finansiell nytta",{"$f":"P63","v":0}]
[{"$nulls":3},"Finansiell nettonytta",{"$f":"P71","v":{"v":-11600000,"d":"-11,600,000 kr"}},{"$nulls":3},"Total kostnad",{"$f":"SUM(J66:J69)","v":{"v":-2800000,"d":"-2,800,000 "}},{"$f":"SUM(K66:K69)","v":{"v":-2000000,"d":"-2,000,000 "}},{"v":-1400000,"d":"-1,400,000 "},{"v":-1800000,"d":"-1,800,000 "},{"v":-1800000,"d":"-1,800,000 "},{"v":-1800000,"d":"-1,800,000 "},{"v":-11600000,"d":"-11,600,000 "}]
[{"$nulls":8},"Verksamhets-förändring",{"$f":"IFERROR(-GETPIVOTDATA(\"Summa av År 1\",'-Admin-'!$C$32,\"Kostnadskategori\",\"1. Verksamhetsförändring\"),0)","v":0},{"$f":"IFERROR(-GETPIVOTDATA(\"Summa av År 2\",'-Admin-'!$C$32,\"Kostnadskategori\",\"1. Verksamhetsförändring\"),0)","v":0},{"$f":"IFERROR(-GETPIVOTDATA(\"Summa av År 3\",'-Admin-'!$C$32,\"Kostnadskategori\",\"1. Verksamhetsförändring\"),0)","v":0},{"$f":"IFERROR(-GETPIVOTDATA(\"Summa av År 4\",'-Admin-'!$C$32,\"Kostnadskategori\",\"1. Verksamhetsförändring\"),0)","v":0},{"$f":"IFERROR(-GETPIVOTDATA(\"Summa av År 5\",'-Admin-'!$C$32,\"Kostnadskategori\",\"1. Verksamhetsförändring\"),0)","v":0},{"$f":"IFERROR(-GETPIVOTDATA(\"Summa av År 6\",'-Admin-'!$C$32,\"Kostnadskategori\",\"1. Verksamhetsförändring\"),0)","v":0},{"$f":"SUM(J66:O66)","v":0}]
[{"$nulls":3},"Return on investment (ROI)",{"$f":"IF(-P65=0,0,P71/-P65)","v":{"v":-1,"d":"-1.00 kr"}},{"$nulls":3},"Löpande verksamhets-kostnader",{"$f":"IFERROR(-GETPIVOTDATA(\"Summa av År 1\",'-Admin-'!$C$32,\"Kostnadskategori\",\"2. Löpande verksamhetskostnader\"),0)","v":0},{"$f":"IFERROR(-GETPIVOTDATA(\"Summa av År 2\",'-Admin-'!$C$32,\"Kostnadskategori\",\"2. Löpande verksamhetskostnader\"),0)","v":0},{"$f":"IFERROR(-GETPIVOTDATA(\"Summa av År 3\",'-Admin-'!$C$32,\"Kostnadskategori\",\"2. Löpande verksamhetskostnader\"),0)","v":{"v":-1400000,"d":"-1,400,000 "}},{"$f":"IFERROR(-GETPIVOTDATA(\"Summa av År 4\",'-Admin-'!$C$32,\"Kostnadskategori\",\"2. Löpande verksamhetskostnader\"),0)","v":{"v":-1800000,"d":"-1,800,000 "}},{"$f":"IFERROR(-GETPIVOTDATA(\"Summa av År 5\",'-Admin-'!$C$32,\"Kostnadskategori\",\"2. Löpande verksamhetskostnader\"),0)","v":{"v":-1800000,"d":"-1,800,000 "}},{"$f":"IFERROR(-GETPIVOTDATA(\"Summa av År 6\",'-Admin-'!$C$32,\"Kostnadskategori\",\"2. Löpande verksamhetskostnader\"),0)","v":{"v":-1800000,"d":"-1,800,000 "}},{"$f":"SUM(J67:O67)","v":{"v":-6800000,"d":"-6,800,000 "}}]
[{"$nulls":3},"Payback-år",{"$f":"'-Admin-'!D112","v":"Ingen payback"},{"$nulls":3},"Investeringar",{"$f":"IFERROR(-GETPIVOTDATA(\"Summa av År 1\",'-Admin-'!$C$32,\"Kostnadskategori\",\"3. Investeringar\"),0)","v":0},{"$f":"IFERROR(-GETPIVOTDATA(\"Summa av År 2\",'-Admin-'!$C$32,\"Kostnadskategori\",\"3. Investeringar\"),0)","v":0},{"$f":"IFERROR(-GETPIVOTDATA(\"Summa av År 3\",'-Admin-'!$C$32,\"Kostnadskategori\",\"3. Investeringar\"),0)","v":0},{"$f":"IFERROR(-GETPIVOTDATA(\"Summa av År 4\",'-Admin-'!$C$32,\"Kostnadskategori\",\"3. Investeringar\"),0)","v":0},{"$f":"IFERROR(-GETPIVOTDATA(\"Summa av År 5\",'-Admin-'!$C$32,\"Kostnadskategori\",\"3. Investeringar\"),0)","v":0},{"$f":"IFERROR(-GETPIVOTDATA(\"Summa av År 6\",'-Admin-'!$C$32,\"Kostnadskategori\",\"3. Investeringar\"),0)","v":0},{"$f":"SUM(J68:O68)","v":0}]
[{"$nulls":8},"Projekt",{"$f":"IFERROR(-GETPIVOTDATA(\"Summa av År 1\",'-Admin-'!$C$32,\"Kostnadskategori\",\"4. Projekt\"),0)","v":{"v":-2800000,"d":"-2,800,000 "}},{"$f":"IFERROR(-GETPIVOTDATA(\"Summa av År 2\",'-Admin-'!$C$32,\"Kostnadskategori\",\"4. Projekt\"),0)","v":{"v":-2000000,"d":"-2,000,000 "}},{"$f":"IFERROR(-GETPIVOTDATA(\"Summa av År 3\",'-Admin-'!$C$32,\"Kostnadskategori\",\"4. Projekt\"),0)","v":0},{"$f":"IFERROR(-GETPIVOTDATA(\"Summa av År 4\",'-Admin-'!$C$32,\"Kostnadskategori\",\"4. Projekt\"),0)","v":0},{"$f":"IFERROR(-GETPIVOTDATA(\"Summa av År 5\",'-Admin-'!$C$32,\"Kostnadskategori\",\"4. Projekt\"),0)","v":0},{"$f":"IFERROR(-GETPIVOTDATA(\"Summa av År 6\",'-Admin-'!$C$32,\"Kostnadskategori\",\"4. Projekt\"),0)","v":0},{"v":-4800000,"d":"-4,800,000 "}]
[]
[{"$nulls":8},"Finansiell nettonytta",{"$f":"J63+J65","v":{"v":-2800000,"d":"-2,800,000 "}},{"v":-2000000,"d":"-2,000,000 "},{"v":-1400000,"d":"-1,400,000 "},{"$f":"M63+M65","v":{"v":-1800000,"d":"-1,800,000 "}},{"v":-1800000,"d":"-1,800,000 "},{"v":-1800000,"d":"-1,800,000 "},{"$f":"P63+P65","v":{"v":-11600000,"d":"-11,600,000 "}}]
[{"$nulls":8},"Ackumulerad finansiell nettonytta",{"$f":"J63+J65","v":{"v":-2800000,"d":"-2,800,000 "}},{"$f":"IF(K71=0,J72,J72+K71)","v":{"v":-4800000,"d":"-4,800,000 "}},{"$f":"IF(L71=0,K72,K72+L71)","v":{"v":-6200000,"d":"-6,200,000 "}},{"$f":"IF(M71=0,L72,L72+M71)","v":{"v":-8000000,"d":"-8,000,000 "}},{"$f":"IF(N71=0,M72,M72+N71)","v":{"v":-9800000,"d":"-9,800,000 "}},{"$f":"IF(O71=0,N72,N72+O71)","v":{"v":-11600000,"d":"-11,600,000 "}},{"$f":"O72","v":{"v":-11600000,"d":"-11,600,000 "}}]
{"$rows_empty":35}
[{"$nulls":3},"Omfördelningsnytta"]
[]
[]
[{"$nulls":3},"Nyttorealiseringskalkyl - omfördelningsnytta",{"$nulls":4},"Nyttorealiseringskalkyl per år"]
[{"$nulls":3},"För perioden",{"$f":"Startår & \" - \" & Startår+5","v":"2020 - 2025"}]
[{"$nulls":9},{"$f":"Startår","v":2020},{"$f":"J113+1","v":2021},{"$f":"K113+1","v":2022},{"$f":"L113+1","v":2023},{"$f":"M113+1","v":2024},{"$f":"N113+1","v":2025},"Totalt"]
[{"$nulls":3},"Total kostnad",{"$f":"TotalKostnad","v":{"v":-11600000,"d":"-11,600,000 "}},{"$nulls":3},"Omfördelningsnyttor",{"$f":"IFERROR(GETPIVOTDATA(\"Summa av år 1\",'-Admin-'!$C$25,\"Nyttokategori\",\"2. Omfördelningsnytta\"),0)","v":0},{"$f":"IFERROR(GETPIVOTDATA(\"Summa av år 2\",'-Admin-'!$C$25,\"Nyttokategori\",\"2. Omfördelningsnytta\"),0)","v":{"v":22400000,"d":"22,400,000 "}},{"$f":"IFERROR(GETPIVOTDATA(\"Summa av år 3\",'-Admin-'!$C$25,\"Nyttokategori\",\"2. Omfördelningsnytta\"),0)","v":{"v":26340000,"d":"26,340,000 "}},{"$f":"IFERROR(GETPIVOTDATA(\"Summa av år 4\",'-Admin-'!$C$25,\"Nyttokategori\",\"2. Omfördelningsnytta\"),0)","v":{"v":26340000,"d":"26,340,000 "}},{"$f":"IFERROR(GETPIVOTDATA(\"Summa av år 5\",'-Admin-'!$C$25,\"Nyttokategori\",\"2. Omfördelningsnytta\"),0)","v":{"v":26340000,"d":"26,340,000 "}},{"$f":"IFERROR(GETPIVOTDATA(\"Summa av år 6\",'-Admin-'!$C$25,\"Nyttokategori\",\"2. Omfördelningsnytta\"),0)","v":{"v":26340000,"d":"26,340,000 "}},{"$f":"SUM(J114:O114)","v":{"v":127760000,"d":"127,760,000 "}}]
[{"$nulls":3},"Total omfördelningsnytta",{"$f":"P114","v":{"v":127760000,"d":"127,760,000 "}}]
[{"$nulls":3},"Omfördelnings-nettonytta",{"$f":"P122","v":{"v":116160000,"d":"116,160,000 "}},{"$nulls":3},"Total kostnad",{"$f":"SUM(J117:J120)","v":{"v":-2800000,"d":"-2,800,000 "}},{"$f":"SUM(K117:K120)","v":{"v":-2000000,"d":"-2,000,000 "}},{"v":-1400000,"d":"-1,400,000 "},{"v":-1800000,"d":"-1,800,000 "},{"v":-1800000,"d":"-1,800,000 "},{"v":-1800000,"d":"-1,800,000 "},{"v":-11600000,"d":"-11,600,000 "}]
[{"$nulls":8},"Verksamhets-förändring",{"$f":"IFERROR(-GETPIVOTDATA(\"Summa av År 1\",'-Admin-'!$C$32,\"Kostnadskategori\",\"1. Verksamhetsförändring\"),0)","v":0},{"$f":"IFERROR(-GETPIVOTDATA(\"Summa av År 2\",'-Admin-'!$C$32,\"Kostnadskategori\",\"1. Verksamhetsförändring\"),0)","v":0},{"$f":"IFERROR(-GETPIVOTDATA(\"Summa av År 3\",'-Admin-'!$C$32,\"Kostnadskategori\",\"1. Verksamhetsförändring\"),0)","v":0},{"$f":"IFERROR(-GETPIVOTDATA(\"Summa av År 4\",'-Admin-'!$C$32,\"Kostnadskategori\",\"1. Verksamhetsförändring\"),0)","v":0},{"$f":"IFERROR(-GETPIVOTDATA(\"Summa av År 5\",'-Admin-'!$C$32,\"Kostnadskategori\",\"1. Verksamhetsförändring\"),0)","v":0},{"$f":"IFERROR(-GETPIVOTDATA(\"Summa av År 6\",'-Admin-'!$C$32,\"Kostnadskategori\",\"1. Verksamhetsförändring\"),0)","v":0},{"$f":"SUM(J117:O117)","v":0}]
[{"$nulls":3},"Return on investment (ROI)",{"$f":"IF(-P116=0,0,P122/-P116)","v":{"v":10.013793103448275,"d":"10.01 kr"}},{"$nulls":3},"Löpande verksamhets-kostnader",{"$f":"IFERROR(-GETPIVOTDATA(\"Summa av År 1\",'-Admin-'!$C$32,\"Kostnadskategori\",\"2. Löpande verksamhetskostnader\"),0)","v":0},{"$f":"IFERROR(-GETPIVOTDATA(\"Summa av År 2\",'-Admin-'!$C$32,\"Kostnadskategori\",\"2. Löpande verksamhetskostnader\"),0)","v":0},{"$f":"IFERROR(-GETPIVOTDATA(\"Summa av År 3\",'-Admin-'!$C$32,\"Kostnadskategori\",\"2. Löpande verksamhetskostnader\"),0)","v":{"v":-1400000,"d":"-1,400,000 "}},{"$f":"IFERROR(-GETPIVOTDATA(\"Summa av År 4\",'-Admin-'!$C$32,\"Kostnadskategori\",\"2. Löpande verksamhetskostnader\"),0)","v":{"v":-1800000,"d":"-1,800,000 "}},{"$f":"IFERROR(-GETPIVOTDATA(\"Summa av År 5\",'-Admin-'!$C$32,\"Kostnadskategori\",\"2. Löpande verksamhetskostnader\"),0)","v":{"v":-1800000,"d":"-1,800,000 "}},{"$f":"IFERROR(-GETPIVOTDATA(\"Summa av År 6\",'-Admin-'!$C$32,\"Kostnadskategori\",\"2. Löpande verksamhetskostnader\"),0)","v":{"v":-1800000,"d":"-1,800,000 "}},{"$f":"SUM(J118:O118)","v":{"v":-6800000,"d":"-6,800,000 "}}]
[{"$nulls":3},"Payback-år",{"$f":"IF('-Admin-'!D119=0,\"Ingen payback\",'-Admin-'!D119)","v":2021},{"$nulls":3},"Investeringar",{"$f":"IFERROR(-GETPIVOTDATA(\"Summa av År 1\",'-Admin-'!$C$32,\"Kostnadskategori\",\"3. Investeringar\"),0)","v":0},{"$f":"IFERROR(-GETPIVOTDATA(\"Summa av År 2\",'-Admin-'!$C$32,\"Kostnadskategori\",\"3. Investeringar\"),0)","v":0},{"$f":"IFERROR(-GETPIVOTDATA(\"Summa av År 3\",'-Admin-'!$C$32,\"Kostnadskategori\",\"3. Investeringar\"),0)","v":0},{"$f":"IFERROR(-GETPIVOTDATA(\"Summa av År 4\",'-Admin-'!$C$32,\"Kostnadskategori\",\"3. Investeringar\"),0)","v":0},{"$f":"IFERROR(-GETPIVOTDATA(\"Summa av År 5\",'-Admin-'!$C$32,\"Kostnadskategori\",\"3. Investeringar\"),0)","v":0},{"$f":"IFERROR(-GETPIVOTDATA(\"Summa av År 6\",'-Admin-'!$C$32,\"Kostnadskategori\",\"3. Investeringar\"),0)","v":0},{"$f":"SUM(J119:O119)","v":0}]
[{"$nulls":8},"Projekt",{"$f":"IFERROR(-GETPIVOTDATA(\"Summa av År 1\",'-Admin-'!$C$32,\"Kostnadskategori\",\"4. Projekt\"),0)","v":{"v":-2800000,"d":"-2,800,000 "}},{"$f":"IFERROR(-GETPIVOTDATA(\"Summa av År 2\",'-Admin-'!$C$32,\"Kostnadskategori\",\"4. Projekt\"),0)","v":{"v":-2000000,"d":"-2,000,000 "}},{"$f":"IFERROR(-GETPIVOTDATA(\"Summa av År 3\",'-Admin-'!$C$32,\"Kostnadskategori\",\"4. Projekt\"),0)","v":0},{"$f":"IFERROR(-GETPIVOTDATA(\"Summa av År 4\",'-Admin-'!$C$32,\"Kostnadskategori\",\"4. Projekt\"),0)","v":0},{"$f":"IFERROR(-GETPIVOTDATA(\"Summa av År 5\",'-Admin-'!$C$32,\"Kostnadskategori\",\"4. Projekt\"),0)","v":0},{"$f":"IFERROR(-GETPIVOTDATA(\"Summa av År 6\",'-Admin-'!$C$32,\"Kostnadskategori\",\"4. Projekt\"),0)","v":0},{"v":-4800000,"d":"-4,800,000 "}]
[]
[{"$nulls":8},"Omfördelnings-nettonytta",{"$f":"J114+J116","v":{"v":-2800000,"d":"-2,800,000 "}},{"v":20400000,"d":"20,400,000 "},{"v":24940000,"d":"24,940,000 "},{"v":24540000,"d":"24,540,000 "},{"v":24540000,"d":"24,540,000 "},{"v":24540000,"d":"24,540,000 "},{"v":116160000,"d":"116,160,000 "}]
[{"$nulls":8},"Ackumulerad omfördelnings-nettonytta",{"$f":"J124","v":0},{"$f":"IF(K122=0,J123,J123+K122)","v":{"v":20400000,"d":"20,400,000 "}},{"$f":"IF(L122=0,K123,K123+L122)","v":{"v":45340000,"d":"45,340,000 "}},{"$f":"IF(M122=0,L123,L123+M122)","v":{"v":69880000,"d":"69,880,000 "}},{"$f":"IF(N122=0,M123,M123+N122)","v":{"v":94420000,"d":"94,420,000 "}},{"$f":"IF(O122=0,N123,N123+O122)","v":{"v":118960000,"d":"118,960,000 "}},{"$f":"O123","v":{"v":118960000,"d":"118,960,000 "}}]

{"sheet":"-Admin-","index":5,"n_rows":120,"n_cols":13,"rows_kept":120,"hidden":true}
[null,null,"Admin"]
[null,null,"I den här fliken finns stödfunktioner som används i kalkylen. Redigera dem bara om du är säker på att du vill ändra hur mallen fungerar. "]
[]
[]
[null,null,"Underlag för rullister i mallen"]
[null,null,"Fördefinierade värden i rullisterna"]
[null,null,"Grunden för att kunna redovisa nyttokalkylen uppdelad på typ av nytta. "]
[]
[null,null,"Nyttokategori"]
[null,null,"1. Finansiell"]
[null,null,"2. Omfördelningsnytta"]
[null,null,"3. Kvalitativ, mätbar"]
[]
[null,null,"Kostnadskategori"]
[null,null,"1. Verksamhetsförändring"]
[null,null,"2. Löpande verksamhetskostnader"]
[null,null,"3. Investeringar"]
[null,null,"4. Projekt"]
[]
[]
[null,null,"Underlag för nyttokalkylen"]
[]
[null,null,"PivotNytta"]
[null,null,"Nyttor"]
[null,null,"Radetiketter","Summa av år 1","Summa av År 2","Summa av År 3","Summa av År 4","Summa av År 5","Summa av År 6"]
[null,null,"2. Omfördelningsnytta",0,{"v":22400000,"d":"22,400,000 "},{"v":26340000,"d":"26,340,000 "},{"v":26340000,"d":"26,340,000 "},{"v":26340000,"d":"26,340,000 "},{"v":26340000,"d":"26,340,000 "}]
[]
[]
[]
[null,null,"PivotKostnad"]
[null,null,"Kostnader"]
[null,null,"Radetiketter","Summa av År 1","Summa av År 2","Summa av År 3","Summa av År 4","Summa av År 5","Summa av År 6"]
[null,null,"2. Löpande verksamhetskostnader",null,null,{"v":1400000,"d":"1,400,000 "},{"v":1800000,"d":"1,800,000 "},{"v":1800000,"d":"1,800,000 "},{"v":1800000,"d":"1,800,000 "}]
[null,null,"4. Projekt",{"v":2800000,"d":"2,800,000 "},{"v":2000000,"d":"2,000,000 "}]
[]
[]
[]
[]
[]
[null,null,"Underlag för  några av diagrammen - övriga diagram hämtar sin data från sammanställningen på fliken Nyttokalkyl"]
[]
[null,null,"Diagram \"Nyttor och kostnader\""]
[]
[{"$nulls":3},"Finansiell nytta","Omfördelningsnytta","Total nytta","Kostnad"]
[null,null,"Nytta",{"$f":"Nyttokalkyl!$P$13","v":0},{"$f":"Nyttokalkyl!P14","v":{"v":127760000,"d":"127,760,000 "}},{"$f":"D45+E45","v":{"v":127760000,"d":"127,760,000 "}}]
[null,null,"Kostnad",{"$nulls":3},{"$f":"-1*TotalKostnad","v":{"v":11600000,"d":"11,600,000 "}}]
[]
[null,null,"PivotNyttaIntressent",null,null,"PivotKostnadIntressent",null,null,"PivotFinansiellNyttaIntressent",null,null,"PivotOmfördelningsnyttaIntressent"]
[null,null,"Diagram \"Nytta per intressent\"",null,null,"Diagram \"Kostnad per intressent\"",null,null,"Diagram \"Finansiell nytta per intressent\"",null,null,"Diagram \"Omfördelningsnytta nytta per intressent\""]
[null,null,"Nyttokategori","2. Omfördelningsnytta",null,"Kostnadskategori","(flera objekt)",null,"Nyttokategori","(flera objekt)",null,"Nyttokategori","2. Omfördelningsnytta"]
[]
[null,null,"Radetiketter","Summa av Summa",null,"Radetiketter","Summa av Summa",null,"Radetiketter","Summa av Summa",null,"Radetiketter","Summa av Summa"]
[null,null,"Inera",{"v":127760000,"d":"127,760,000 "},null,"Inera",{"v":11600000,"d":"11,600,000 "},null,"Totalsumma",null,null,"Inera",{"v":127760000,"d":"127,760,000 "}]
[null,null,"Totalsumma",{"v":127760000,"d":"127,760,000 "},null,"Totalsumma",{"v":11600000,"d":"11,600,000 "},{"$nulls":4},"Totalsumma",{"v":127760000,"d":"127,760,000 "}]
{"$rows_empty":12}
[null,null,"PivotNyttaOsäkerhet",{"$nulls":5},"PivotKostnadOsäkerhet"]
[null,null,"PivotNytta - underlag till diagram \"osäkerhetsanalys\" ",{"$nulls":5},"PivotKostnad - underlag till diagram \"osäkerhetsanalys\" "]
[null,null,"Radetiketter","Summa av Min","Summa av Summa","Summa av Max",null,null,"Radetiketter","Summa av Min","Summa av Summa","Summa av Max"]
[null,null,"2. Omfördelningsnytta",{"v":36312000,"d":"36,312,000 "},{"v":127760000,"d":"127,760,000 "},{"v":249360000,"d":"249,360,000 "},null,null,"2. Löpande verksamhetskostnader",{"v":5440000,"d":"5,440,000 "},{"v":6800000,"d":"6,800,000 "},{"v":6528000,"d":"6,528,000 "}]
[null,null,"Totalsumma",{"v":36312000,"d":"36,312,000 "},{"v":127760000,"d":"127,760,000 "},{"v":249360000,"d":"249,360,000 "},null,null,"4. Projekt",{"v":3840000,"d":"3,840,000 "},{"v":4800000,"d":"4,800,000 "},{"v":4608000,"d":"4,608,000 "}]
[{"$nulls":8},"Totalsumma",{"v":9280000,"d":"9,280,000 "},{"v":11600000,"d":"11,600,000 "},{"v":11136000,"d":"11,136,000 "}]
[]
[]
[]
[]
[null,null,"Diagram \"Osäkerhetsanalys\" Alla nyttor"]
[{"$nulls":3},"Nytta","Kostnad","Nettonytta"]
[null,null,"Min",{"$f":"IFERROR(GETPIVOTDATA(\"Summa av Min\",$C$69,\"Nyttokategori\",\"1. Finansiell\"),0)+IFERROR(GETPIVOTDATA(\"Summa av Min\",$C$69,\"Nyttokategori\",\"2. Omfördelningsnytta\"),0)","v":{"v":36312000,"d":"36,312,000 "}},{"$f":"GETPIVOTDATA(\"Summa av Min\",$I$69)","v":{"v":9280000,"d":"9,280,000 "}},{"$f":"D79-E81","v":{"v":25176000,"d":"25,176,000 "}}]
[null,null,"Troligt",{"$f":"IFERROR(GETPIVOTDATA(\"Summa av Summa\",$C$69,\"Nyttokategori\",\"1. Finansiell\"),0)+IFERROR(GETPIVOTDATA(\"Summa av Summa\",$C$69,\"Nyttokategori\",\"2. Omfördelningsnytta\"),0)","v":{"v":127760000,"d":"127,760,000 "}},{"$f":"GETPIVOTDATA(\"Summa av Summa\",$I$69)","v":{"v":11600000,"d":"11,600,000 "}},{"$f":"D80-E80","v":{"v":116160000,"d":"116,160,000 "}}]
[null,null,"Max",{"$f":"IFERROR(GETPIVOTDATA(\"Summa av Max\",$C$69,\"Nyttokategori\",\"1. Finansiell\"),0)+IFERROR(GETPIVOTDATA(\"Summa av Max\",$C$69,\"Nyttokategori\",\"2. Omfördelningsnytta\"),0)","v":{"v":249360000,"d":"249,360,000 "}},{"$f":"GETPIVOTDATA(\"Summa av Max\",$I$69)","v":{"v":11136000,"d":"11,136,000 "}},{"$f":"D81-E79","v":{"v":240080000,"d":"240,080,000 "}}]
[]
[]
[null,null,"Diagram \"Osäkerhetsanalys\" Finansiella nyttor"]
[{"$nulls":3},"Finansiell nytta","Kostnad","Nettonytta"]
[null,null,"Min",{"$f":"IFERROR(GETPIVOTDATA(\"Summa av Min\",$C$69,\"Nyttokategori\",\"1. Finansiell\"),0)","v":0},{"$f":"GETPIVOTDATA(\"Summa av Min\",$I$69)","v":{"v":9280000,"d":"9,280,000 "}},{"$f":"D86-E88","v":{"v":-11136000,"d":"-11,136,000 "}}]
[null,null,"Troligt",{"$f":"IFERROR(GETPIVOTDATA(\"Summa av Summa\",$C$69,\"Nyttokategori\",\"1. Finansiell\"),0)","v":0},{"$f":"GETPIVOTDATA(\"Summa av Summa\",$I$69)","v":{"v":11600000,"d":"11,600,000 "}},{"$f":"D87-E87","v":{"v":-11600000,"d":"-11,600,000 "}}]
[null,null,"Max",{"$f":"IFERROR(GETPIVOTDATA(\"Summa av Max\",$C$69,\"Nyttokategori\",\"1. Finansiell\"),0)","v":0},{"$f":"GETPIVOTDATA(\"Summa av Max\",$I$69)","v":{"v":11136000,"d":"11,136,000 "}},{"$f":"D88-E86","v":{"v":-9280000,"d":"-9,280,000 "}}]
[]
[]
[null,null,"Diagram \"Osäkerhetsanalys\" Omfördelningsnyttor"]
[{"$nulls":3},"Omfördelningsnytta","Kostnad","Nettonytta"]
[null,null,"Min",{"$f":"IFERROR(GETPIVOTDATA(\"Summa av Min\",$C$69,\"Nyttokategori\",\"2. Omfördelningsnytta\"),0)","v":{"v":36312000,"d":"36,312,000 "}},{"$f":"Kostnader[[#Totals],[Min]]","v":{"v":9280000,"d":"9,280,000 "}},{"$f":"D93-E95","v":{"v":25176000,"d":"25,176,000 "}}]
[null,null,"Troligt",{"$f":"IFERROR(GETPIVOTDATA(\"Summa av Summa\",$C$69,\"Nyttokategori\",\"2. Omfördelningsnytta\"),0)","v":{"v":127760000,"d":"127,760,000 "}},{"$f":"Kostnader[[#Totals],[Summa]]","v":{"v":11600000,"d":"11,600,000 "}},{"$f":"D94-E94","v":{"v":116160000,"d":"116,160,000 "}}]
[null,null,"Max",{"$f":"IFERROR(GETPIVOTDATA(\"Summa av Max\",$C$69,\"Nyttokategori\",\"2. Omfördelningsnytta\"),0)","v":{"v":249360000,"d":"249,360,000 "}},{"$f":"Kostnader[[#Totals],[Max]]","v":{"v":11136000,"d":"11,136,000 "}},{"$f":"D95-E93","v":{"v":240080000,"d":"240,080,000 "}}]
[]
[]
[null,null,"Underlag för payback-år"]
[null,null,"Alla nyttor"]
[null,null,"Följande rader används för beräkning av Payback-år",{"$f":"Startår","v":2020},{"$f":"D100+1","v":2021},{"$f":"E100+1","v":2022},2023,2024,2025]
[null,null,"Ack. diskonterat kassaflöde > 0?",{"$f":"Nyttokalkyl!J27>0","v":false},{"$f":"Nyttokalkyl!K27>0","v":true},{"$f":"Nyttokalkyl!L27>0","v":true},{"$f":"Nyttokalkyl!M27>0","v":true},{"$f":"Nyttokalkyl!N27>0","v":true},{"$f":"Nyttokalkyl!O27>0","v":true}]
[null,null,"Är detta ett paybackår?",{"$f":"IF(D101=FALSE,\"x\",D100)","v":"x"},{"$f":"IF(E101=FALSE,\"x\",E100)","v":{"v":2021,"d":"2,021 "}},{"v":2022,"d":"2,022 "},{"v":2023,"d":"2,023 "},{"v":2024,"d":"2,024 "},{"v":2025,"d":"2,025 "}]
[null,null,"Första paybackår (om något)",{"$f":"MIN(D102:I102)","v":{"v":2021,"d":"2,021 "}}]
[null,null,"Paybackår?",{"$f":"IF('-Admin-'!D103=0,\"Ingen payback\",'-Admin-'!D103)","v":2021}]
[]
[]
[null,null,"Finansiella nyttor"]
[null,null,"Följande rader används för beräkning av Payback-år",{"$f":"Startår","v":2020},{"$f":"D108+1","v":2021},{"$f":"E108+1","v":2022},{"$f":"F108+1","v":2023},{"$f":"G108+1","v":2024},{"$f":"H108+1","v":2025}]
[null,null,"Ack. diskonterat kassaflöde > 0?",{"$f":"Nyttokalkyl!J72>0","v":false},{"$f":"Nyttokalkyl!K72>0","v":false},{"$f":"Nyttokalkyl!L72>0","v":false},{"$f":"Nyttokalkyl!M72>0","v":false},{"$f":"Nyttokalkyl!N72>0","v":false},{"$f":"Nyttokalkyl!O72>0","v":false}]
[null,null,"Är detta ett paybackår?",{"$f":"IF(D109=FALSE,\"x\",D108)","v":"x"},{"$f":"IF(E109=FALSE,\"x\",E108)","v":"x"},"x","x","x","x"]
[null,null,"Första paybackår (om något)",{"$f":"MIN(D110:I110)","v":0}]
[null,null,"Paybackår?",{"$f":"IF('-Admin-'!D111=0,\"Ingen payback\",'-Admin-'!D111)","v":"Ingen payback"}]
[]
[]
[null,null,"Omfördelningsnyttor"]
[null,null,"Följande rader används för beräkning av Payback-år",{"$f":"Startår","v":2020},{"$f":"D116+1","v":2021},{"$f":"E116+1","v":2022},{"$f":"F116+1","v":2023},{"$f":"G116+1","v":2024},{"$f":"H116+1","v":2025}]
[null,null,"Ack. diskonterat kassaflöde > 0?",{"$f":"Nyttokalkyl!J123>0","v":false},{"$f":"Nyttokalkyl!K123>0","v":true},{"$f":"Nyttokalkyl!L123>0","v":true},{"$f":"Nyttokalkyl!M123>0","v":true},{"$f":"Nyttokalkyl!N123>0","v":true},{"$f":"Nyttokalkyl!O123>0","v":true}]
[null,null,"Är detta ett paybackår?",{"$f":"IF(D117=FALSE,\"x\",D116)","v":"x"},{"$f":"IF(E117=FALSE,\"x\",E116)","v":{"v":2021,"d":"2,021 "}},{"v":2022,"d":"2,022 "},{"v":2023,"d":"2,023 "},{"v":2024,"d":"2,024 "},{"v":2025,"d":"2,025 "}]
[null,null,"Första paybackår (om något)",{"$f":"MIN(D118:I118)","v":{"v":2021,"d":"2,021 "}}]
[null,null,"Paybackår?",{"$f":"IF('-Admin-'!D119=0,\"Ingen payback\",'-Admin-'!D119)","v":2021}]